program: Gaussian 09
title: 000020549
version: EM64L-G09RevD.01
frameworkgroup: C1[X(C18H18N2O4)]
method: RPBEPBE
basis: SDD
operation: Freq
keyword: #p
keyword: freq=noraman
keyword: PBEPBE/SDD
title: #p freq=noraman PBEPBE/SDD
converged: YES YES NO NO
title: Mulliken charges:
elementType: O O O O N N C C C C C C C C C C C C C C C C C C H H H H H H H H H H H H H H H H H H
charge: -0.311190 -0.318221 -0.425692 -0.455578 -0.392846 -0.390552 0.127639 0.131920 0.264728 0.268626 0.283170 0.285804 -0.171595 -0.167799 -0.387336 -0.391579 -0.393038 -0.394614 -0.376561 -0.331947 -0.232972 -0.232587 -0.357847 -0.351604 0.239232 0.237657 0.406069 0.398808 0.293119 0.290360 0.211724 0.213767 0.238131 0.196417 0.232903 0.232160 0.195294 0.234767 0.199739 0.207309 0.337740 0.356473
chargesum: 0.00000
title: Mulliken charges with hydrogens summed into heavy atoms:
elementType: O O O O N N C C C C C C C C C C C C C C C C C C
charge: -0.311190 -0.318221 -0.087953 -0.099106 0.013222 0.008256 0.127639 0.131920 0.264728 0.268626 0.283170 0.285804 -0.171595 -0.167799 -0.148103 -0.153922 -0.099919 -0.104254 0.048930 0.102601 -0.000069 -0.000428 0.072215 0.055444
polarizability: 3.13473530e+02 2.13066685e+00 3.81557150e+02 3.98962285e+00 -2.25412486e-01 1.08894655e+02
1716.lowfreq: -6.7669 -2.6228 -0.0006 0.0004 0.0007 5.3248 25.7326 35.5799 49.3146
frequency: 25.6803 35.5567 49.3074 54.8815 66.7962 78.4975 98.5250 105.5025 131.6768 133.1602 169.2789 174.8846 185.7108 220.1213 239.2677 257.6712 271.0670 288.4275 304.8658 320.9669 341.4947 358.6092 384.4059 388.2228 424.9135 427.4102 427.5110 449.6631 485.3278 495.0657 498.5170 506.0088 563.3822 605.7817 623.2717 663.3051 666.1708 704.6523 725.5529 732.9923 762.5024 802.8174 810.2532 826.7562 846.2955 852.2108 855.6359 856.7294 880.5526 886.3671 904.2880 910.7693 929.6134 946.5293 975.0463 996.0642 1011.4042 1017.9522 1021.1877 1040.2870 1046.5452 1055.5693 1064.1688 1085.7760 1130.1814 1133.6016 1163.1395 1164.6070 1177.2435 1185.8561 1193.0653 1229.5385 1243.4097 1251.9198 1267.2760 1275.9723 1295.6195 1318.6252 1320.9505 1325.4669 1358.0047 1370.6833 1373.4877 1383.8278 1386.7020 1390.4103 1404.3483 1407.7773 1452.2566 1458.8534 1461.2721 1464.3134 1471.5733 1473.2683 1477.3705 1500.8497 1538.3037 1541.7807 1566.9370 1590.4443 1609.4302 1642.3641 2904.5414 2946.3967 2952.2087 2964.1851 2977.0247 3003.2351 3013.2837 3086.7886 3116.3438 3130.1972 3135.5444 3145.4316 3148.3312 3163.1084 3168.3409 3170.3699 3554.7606 3589.1992
redmass: 5.3621 5.6133 4.5018 4.7811 5.5931 4.3229 3.8859 3.3466 4.7958 3.7025 6.0507 5.0088 7.1098 1.4678 2.1836 2.2929 5.1367 4.2070 2.8401 3.2476 1.4077 4.2700 4.7763 9.2517 6.1207 6.5400 4.4507 5.5591 3.6388 3.5976 5.6092 4.6874 3.0644 4.9640 5.8397 4.8119 5.2679 6.8294 2.2961 5.4262 4.1941 1.6398 2.0398 3.1916 2.9821 1.3421 2.6616 1.3591 2.1759 2.3524 3.6207 3.0091 1.8481 1.3678 3.2164 1.3859 1.3540 1.8045 2.2147 2.7760 1.9019 2.1084 2.4955 2.4842 2.5112 2.4771 2.2276 1.1183 1.2906 1.4673 1.2407 1.1974 1.5231 1.2605 1.7321 1.2253 1.9760 2.0097 1.3238 2.9818 1.9384 1.4471 6.1460 1.9447 1.6071 2.9663 3.9436 1.8934 2.8684 2.9620 1.1555 1.1500 1.1216 1.2187 2.7319 5.1939 4.4328 2.6252 2.5209 5.3704 6.5048 6.6295 1.0652 1.0592 1.0588 1.0765 1.0857 1.0985 1.1072 1.0959 1.0829 1.0861 1.0822 1.0857 1.0908 1.0942 1.0963 1.0991 1.0662 1.0669
irintensity: 0.0739 2.1286 11.1975 0.3378 1.1868 0.9303 2.3639 3.8756 5.0371 2.9278 0.5722 3.9641 0.3563 116.1260 44.6266 19.1881 3.7725 3.9617 86.4474 52.5941 118.3567 6.7267 7.5296 3.1496 0.8978 8.5993 4.3516 13.1203 5.3225 11.9590 24.4505 0.1206 25.7034 4.8312 1.3075 2.2223 14.2288 5.9101 19.4714 0.1068 6.9983 98.8120 17.4272 4.6867 25.0126 8.9477 1.1829 43.1593 46.9428 75.4949 6.8913 14.2045 0.0091 0.3372 14.9485 5.3547 0.0130 56.4425 66.3986 60.2743 17.5570 6.8015 12.2940 6.7073 17.8083 6.9960 5.3658 0.6615 7.2981 29.5902 23.3562 16.6258 17.4011 40.6161 91.9201 30.1823 44.1176 114.2421 7.1606 485.5170 5.1861 35.7090 1.3919 20.8262 57.4188 0.9739 16.2546 0.6702 5.9172 11.1805 77.1888 6.2021 58.7803 14.5471 1.4251 9.9466 619.9444 139.1986 69.1365 80.2563 0.1047 134.6782 119.8742 48.8224 99.0971 45.6178 120.6457 66.4376 72.5062 23.3474 22.3576 5.0683 27.7251 5.9490 18.0886 2.3743 26.4704 30.5931 6.2237 8.0614
temp: 298.150 k
press: 1.00000 atm
elementType: 8 8 8 8 7 7 6 6 6 6 6 6 6 6 6 6 6 6 6 6 6 6 6 6 1 1 1 1 1 1 1 1 1 1 1 1 1 1 1 1 1 1
symmnumber: 1
zpe: 862743.5 jmol-1
zpe.correction: 0.328602 hartree
zpe.thermalcorrener: 0.350276 hartree
zpe.thermalcorrenthalpy: 0.351220 hartree
zpe.thermalcorrgfe: 0.276920 hartree
zpe.sumelectzpe: -1105.409564 hartree
zpe.sumelectthermal: -1105.387890 hartree
zpe.sumelectthermalent: -1105.386945 hartree
zpe.sumelectthermalfe: -1105.461245 hartree
dipole: 1.8627 -5.8504 2.0851
dipole: 6.4842
quadrupole: -126.9537 -108.1752 -141.8690
quadrupole: 7.2395 6.4996 -4.0501
quadrupole: -1.2878 17.4908 -16.2031 7.2395 6.4996 -4.0501
hfenergy: -1105.7381655 hartree
pointgroup: C01 [X(C18H18N2O4)]
dipole: 0.7516334 -2.2966531 0.8175827 debye
polarizability: 313.475004|1.6657246|381.5830172|3.214195|-0.2160518|108.8673141 unknown
InChI: InChI=1S/C18H18N2O4/c21-9-7-19-13-5-6-14(20-8-10-22)16-15(13)17(23)11-3-1-2-4-12(11)18(16)24/h1-6,19-22H,7-10H2
charge 0 multiplicity 1
42 atoms
O  -2.756774 1.03235 -0.038336
O  2.784304 1.024801 0.025259
O  -5.673703 -1.478592 0.554287
O  5.613423 -1.536368 -0.593053
N  -2.816473 -1.541952 -0.102894
N  2.831722 -1.550081 0.072636
C  -0.712631 -0.270625 -0.029204
C  0.735462 -0.272957 0.001965
C  -1.44055 -1.517971 -0.056207
C  1.458694 -1.524555 0.021037
C  -0.697058 2.267816 -0.01158
C  0.72692 2.265279 0.005886
C  -1.457097 0.994213 -0.028884
C  1.483635 0.989041 0.013266
C  -0.686559 -2.744903 -0.042421
C  0.699809 -2.748323 -0.007408
C  -1.398752 3.501733 -0.016054
C  1.431358 3.4976 0.016889
C  -3.621844 -2.761108 -0.107965
C  3.651806 -2.760775 0.067967
C  -0.6927 4.71827 -0.004016
C  0.728513 4.716095 0.012105
C  -5.097674 -2.436346 -0.396072
C  5.091119 -2.419672 0.459152
H  -1.216263 -3.701901 -0.059231
H  1.22643 -3.707158 -0.011796
H  -3.266222 -0.598417 -0.051155
H  3.281874 -0.610351 -0.008414
H  -2.492414 3.468941 -0.029756
H  2.524914 3.462254 0.028011
H  -3.540439 -3.298714 0.865774
H  -3.269195 -3.464833 -0.891836
H  3.659202 -3.241753 -0.933678
H  3.264049 -3.503809 0.794286
H  -1.237817 5.668605 -0.008063
H  1.276184 5.664987 0.020262
H  -5.676992 -3.383668 -0.420212
H  -5.193582 -1.936146 -1.373913
H  5.683975 -3.356173 0.521753
H  5.099351 -1.91807 1.449642
H  -5.608552 -1.842561 1.474014
H  6.428146 -1.071904 -0.279343
