program: Gaussian 09
title: 000243230
version: EM64L-G09RevD.01
frameworkgroup: C1[X(C18H12ClNO3)]
method: RPBEPBE
basis: SDD
operation: Freq
keyword: #p
keyword: freq=noraman
keyword: PBEPBE/SDD
title: #p freq=noraman PBEPBE/SDD
converged: YES YES NO NO
title: Mulliken charges:
elementType: Cl O O O N C C C C C C C C C C C C C C C C C C H H H H H H H H H H H H
charge: -0.010406 -0.278550 -0.216340 -0.216280 0.021387 0.387812 0.334052 0.412083 -0.381004 -0.391347 -0.329848 -0.350152 -0.388576 -0.383095 0.357410 -0.293261 -0.342546 -0.232070 -0.234815 0.380758 -0.236077 -0.352372 -0.330165 0.270971 0.250338 0.263989 0.238197 0.239370 0.268193 0.268768 0.230667 0.231189 0.286692 0.290100 0.234929
chargesum: 0.00000
title: Mulliken charges with hydrogens summed into heavy atoms:
elementType: Cl O O O N C C C C C C C C C C C C C C C C C C
charge: -0.010406 -0.278550 -0.216340 -0.216280 0.021387 0.387812 0.334052 0.412083 -0.110033 -0.141009 -0.329848 -0.086163 -0.150379 -0.143725 0.357410 -0.025068 -0.073778 -0.001404 -0.003626 0.380758 -0.001148 -0.065681 -0.040065
polarizability: 4.01846457e+02 1.95458079e+01 1.71738358e+02 -1.59116284e+01 2.10571434e+01 1.62062063e+02
1716.lowfreq: -8.0313 -4.8815 -0.7729 -0.0015 -0.0005 0.0007 14.5200 23.4055 31.4764
frequency: 14.5075 23.3447 31.4221 52.7490 74.0425 80.7121 86.3900 101.8576 146.0219 172.6306 203.2348 221.9976 253.6337 271.6262 303.5389 333.2839 345.2785 404.7442 415.9554 417.5355 425.3689 459.2133 477.6471 490.4891 507.2622 522.7295 570.5983 605.6885 614.3018 621.3114 634.9324 662.7133 672.5989 699.1760 701.7530 726.7584 735.0327 763.1334 771.2186 805.1203 828.8889 838.0517 849.5643 854.2220 865.9483 882.2341 923.2382 956.8667 975.0678 979.7703 987.8243 989.1818 996.0031 997.7119 1011.2011 1029.7155 1044.3439 1086.4494 1094.9501 1107.6967 1139.7478 1161.2471 1175.7654 1187.3468 1198.3710 1220.0341 1230.1462 1253.7828 1287.3718 1293.9175 1310.3550 1349.7534 1356.7315 1371.5193 1398.9822 1407.5986 1431.3347 1437.8147 1463.8082 1471.4396 1500.3823 1558.6596 1587.4275 1593.9616 1599.8743 1612.8535 1613.9921 3126.1928 3128.9599 3141.9156 3149.3456 3151.9893 3163.7301 3164.2247 3168.2429 3171.1716 3171.4890 3186.0576 3190.8272
redmass: 9.4558 6.9663 5.6326 4.7363 6.4911 6.1551 7.1077 7.9433 5.0396 8.7643 8.3551 7.2728 6.6180 6.9440 8.4910 5.9592 8.8953 2.8371 3.0931 4.4948 5.7586 4.0672 4.7469 3.7059 7.3419 3.9084 6.5158 6.5857 6.3181 6.0740 4.6792 4.7193 7.2974 5.0847 1.7739 4.8762 4.5617 4.5518 2.2089 6.4219 1.2534 1.5485 1.2838 1.6461 5.5228 1.4708 1.4429 1.3703 1.4407 1.3284 1.3483 5.1279 2.9117 1.3203 5.2883 3.2059 1.9782 1.6197 3.2259 1.2410 1.4047 1.4166 1.0530 2.0883 1.2721 4.0018 3.6307 1.5786 1.2719 2.8355 1.6127 2.6719 8.3733 7.7020 5.0649 9.0750 4.3914 2.3669 2.3898 2.4432 2.9019 7.0460 6.2865 7.6894 6.8887 6.1747 6.8459 1.0851 1.0876 1.0918 1.0894 1.0952 1.0893 1.0921 1.1015 1.0897 1.0966 1.0958 1.0974
irintensity: 0.1429 0.2662 0.0380 0.0568 0.0983 0.3910 2.2420 1.6671 0.2331 1.7799 0.5005 1.0738 2.5608 0.2296 0.1562 0.1783 0.5134 0.2464 0.7452 5.2821 1.7195 3.4328 16.6892 3.5229 2.2950 7.9141 2.8166 18.1315 0.2146 0.8940 2.6147 15.4080 21.1065 5.3619 46.2407 9.3384 4.9603 42.5510 42.7836 23.9787 0.5418 26.9811 4.1018 65.3181 48.5568 13.1883 0.9372 0.6191 0.5804 3.8731 0.0450 0.8784 5.1233 0.0287 22.8660 37.2187 6.0719 7.3442 17.5990 22.1176 3.7076 236.1295 0.0258 22.1043 3.5912 916.4490 25.0553 48.4711 2.1994 14.6749 8.0857 4.6478 95.8628 1.2658 9.0422 20.0107 15.3553 5.1653 304.0660 46.9847 26.7114 13.3460 1.4698 70.0782 54.0483 30.3550 131.2319 8.5055 0.4622 14.6699 4.9182 32.5165 3.3484 1.0416 26.4331 0.7910 3.1707 1.2176 4.0811
temp: 298.150 k
press: 1.00000 atm
elementType: 17 8 8 8 7 6 6 6 6 6 6 6 6 6 6 6 6 6 6 6 6 6 6 1 1 1 1 1 1 1 1 1 1 1 1
symmnumber: 1
zpe: 663023.3 jmol-1
zpe.correction: 0.252532 hartree
zpe.thermalcorrener: 0.271551 hartree
zpe.thermalcorrenthalpy: 0.272495 hartree
zpe.thermalcorrgfe: 0.201773 hartree
zpe.sumelectzpe: -1431.929219 hartree
zpe.sumelectthermal: -1431.910201 hartree
zpe.sumelectthermalent: -1431.909257 hartree
zpe.sumelectthermalfe: -1431.979979 hartree
dipole: 7.8680 -1.2165 -1.5462
dipole: 8.1102
quadrupole: -163.0418 -143.7355 -132.5934
quadrupole: 21.5302 -0.9950 6.0016
quadrupole: -16.5849 2.7214 13.8635 21.5302 -0.9950 6.0016
hfenergy: -1432.1817514 hartree
pointgroup: C01 [X(C18H12Cl1N1O3)]
dipole: -3.0880012 0.16998 -0.7852176 debye
polarizability: 399.7749794|31.2045441|159.8680655|13.7171408|-18.934697|176.0038321 unknown
InChI: InChI=1S/C18H12ClNO3/c19-17-12-14(13-4-2-1-3-5-13)6-11-18(17)23-16-9-7-15(8-10-16)20(21)22/h1-12H
charge 0 multiplicity 1
35 atoms
Cl 0.22397 1.908855 1.97635
O  1.242277 1.548408 -0.913592
O  6.024472 -2.229623 1.031305
O  7.173716 -0.394463 0.30842
N  6.073994 -1.040872 0.523233
C  -2.710631 0.077386 -0.262301
C  -4.106338 -0.401689 -0.050249
C  -0.041036 1.000041 -0.658489
C  -1.981384 0.673688 0.803248
C  -2.074286 -0.038196 -1.529482
C  -0.666535 1.126451 0.602875
C  -0.757234 0.419735 -1.725763
C  -5.062817 -0.345223 -1.10134
C  -4.516393 -0.927853 1.205857
C  2.397714 0.852864 -0.512678
C  2.373266 -0.449611 0.044281
C  3.618493 1.538025 -0.730085
C  -6.383713 -0.799694 -0.903561
C  -5.837287 -1.3816 1.40474
C  4.801802 -0.384074 0.166069
C  -6.778206 -1.32022 0.350795
C  3.587243 -1.07109 0.386305
C  4.829649 0.917478 -0.389904
H  -2.450695 0.820833 1.780276
H  -2.602349 -0.51529 -2.360863
H  -0.264121 0.333881 -2.698789
H  -4.78262 0.087191 -2.068578
H  -3.79099 -1.013338 2.023104
H  1.423892 -0.96785 0.205605
H  3.591586 2.543495 -1.158308
H  -7.107207 -0.738134 -1.723912
H  -6.129566 -1.791096 2.377889
H  3.611126 -2.075024 0.817848
H  5.790687 1.414855 -0.54215
H  -7.803878 -1.672442 0.504841
