program: Gaussian 09
title: 000243227
version: EM64L-G09RevD.01
frameworkgroup: C1[X(C14H12N2O6)]
method: RPBEPBE
basis: SDD
operation: Freq
keyword: #p
keyword: freq=noraman
keyword: PBEPBE/SDD
title: #p freq=noraman PBEPBE/SDD
converged: YES YES NO NO
title: Mulliken charges:
elementType: O O O O O O N N C C C C C C C C C C C C C C H H H H H H H H H H H H
charge: -0.236398 -0.268292 -0.195510 -0.167225 -0.208094 -0.200187 0.010390 0.018410 0.179363 0.270132 0.247713 0.476373 0.284352 -0.485600 -0.329901 -0.418704 -0.256099 -0.486882 0.430924 -0.393351 -0.808148 -0.531673 0.250010 0.266764 0.242635 0.276749 0.331136 0.291782 0.228974 0.230028 0.240051 0.231603 0.223120 0.255554
chargesum: 0.00000
title: Mulliken charges with hydrogens summed into heavy atoms:
elementType: O O O O O O N N C C C C C C C C C C C C C C
charge: -0.236398 -0.268292 -0.195510 -0.167225 -0.208094 -0.200187 0.010390 0.018410 0.179363 0.270132 0.247713 0.476373 0.284352 -0.235590 -0.063137 -0.176069 0.020649 -0.155746 0.430924 -0.101569 -0.109095 0.178604
polarizability: 3.02631418e+02 6.81960771e+00 1.88214979e+02 -2.60220733e+01 -2.19507783e+00 1.38900869e+02
1716.lowfreq: -7.3555 -6.1951 0.0004 0.0005 0.0006 0.6900 23.0427 25.8794 38.6767
frequency: 22.9885 25.8093 38.6578 42.3892 47.1750 57.0837 95.2161 100.4510 128.2048 139.7872 152.4083 176.0078 189.6919 206.4765 250.9851 259.0097 299.1610 307.5092 327.2227 347.7243 349.6347 389.2802 423.1465 450.6322 486.3133 513.2904 515.6614 527.5833 529.8082 580.9684 600.5132 632.4509 650.9912 667.4254 698.9855 710.3497 712.0936 736.2851 748.7135 758.3250 817.8085 822.0611 839.5043 853.7194 884.5114 904.5152 948.6846 950.9333 988.3784 990.3376 1011.8350 1046.6910 1053.1735 1102.7427 1113.5979 1114.4103 1142.5287 1145.9646 1161.6195 1189.3557 1203.4833 1217.7757 1235.6414 1250.5945 1267.9052 1282.9825 1357.8396 1373.1088 1377.6380 1398.0841 1400.9071 1403.9097 1432.0197 1445.6121 1464.1994 1468.2499 1470.7994 1472.0232 1475.8480 1494.4841 1585.1072 1597.5500 1603.3400 1615.8418 2971.0400 2980.0496 3059.4994 3063.6581 3092.3229 3136.5069 3146.5787 3149.4814 3165.0716 3172.9341 3187.9913 3189.8673
redmass: 5.8154 5.6467 3.1432 1.5741 3.7250 14.4449 5.1077 3.6584 5.6203 10.6123 5.5960 4.7271 1.9526 4.5091 2.4695 2.3561 7.8583 7.7982 6.2037 8.9452 3.3621 5.9420 4.4274 3.4353 5.3823 6.6573 5.2347 6.4988 4.2257 4.5191 5.4569 6.5358 7.2708 7.2401 6.1482 5.4730 5.6965 5.0079 4.9737 8.9593 2.8782 1.7568 1.5319 1.4519 6.6643 4.9799 1.3467 1.4740 1.3561 2.4556 2.0264 1.5503 2.2488 3.1666 4.7829 1.2552 1.3048 1.4756 1.6309 1.7004 9.4843 6.8897 3.3835 1.6406 1.7113 3.1447 7.0293 11.6076 6.5340 1.3781 2.8175 4.6715 6.8150 1.2781 2.7468 1.0868 1.0902 1.0797 1.1095 2.6255 9.0570 6.9430 6.9297 7.1341 1.0326 1.0383 1.0965 1.1044 1.0989 1.1001 1.0895 1.0906 1.0894 1.0967 1.0951 1.0936
irintensity: 0.6838 0.2616 0.7861 0.3907 0.0998 0.1247 3.5272 5.6696 4.3675 3.1034 1.3645 0.4495 0.0487 1.0230 0.8905 0.7564 0.2642 0.5627 0.3879 0.4671 4.3790 0.5547 0.4387 9.4753 5.0174 0.6069 2.8979 7.4888 1.0238 4.5416 10.6054 10.3944 12.7333 14.5895 6.9370 9.0929 9.3134 8.2479 9.2584 15.0892 28.4149 31.1013 28.0664 7.8999 29.8651 3.2227 0.8041 26.2083 0.3907 28.3908 22.9161 17.2146 34.8785 93.6222 24.7001 0.1056 36.4672 35.1666 21.1232 105.0128 343.6397 369.2162 192.1992 33.5558 44.7063 125.1069 91.7551 70.9298 29.1115 13.4590 29.3581 35.3336 13.2440 8.2622 146.4129 49.9840 31.2213 43.2548 21.4137 104.9002 25.3240 5.8950 96.7830 169.8051 50.7780 34.2663 16.4342 35.4448 17.4483 13.0755 10.8703 9.0964 0.7409 2.1192 4.0191 16.7333
temp: 298.150 k
press: 1.00000 atm
elementType: 8 8 8 8 8 8 7 7 6 6 6 6 6 6 6 6 6 6 6 6 6 6 1 1 1 1 1 1 1 1 1 1 1 1
symmnumber: 1
zpe: 635149.6 jmol-1
zpe.correction: 0.241916 hartree
zpe.thermalcorrener: 0.262269 hartree
zpe.thermalcorrenthalpy: 0.263213 hartree
zpe.thermalcorrgfe: 0.189956 hartree
zpe.sumelectzpe: -1099.755603 hartree
zpe.sumelectthermal: -1099.735250 hartree
zpe.sumelectthermalent: -1099.734306 hartree
zpe.sumelectthermalfe: -1099.807563 hartree
dipole: 9.1210 -4.1007 0.2824
dipole: 10.0044
quadrupole: -134.7342 -144.9137 -115.2138
quadrupole: -11.9332 3.8256 -9.2934
quadrupole: -3.1136 -13.2932 16.4068 -11.9332 3.8256 -9.2934
hfenergy: -1099.9975192 hartree
pointgroup: C01 [X(C14H12N2O6)]
dipole: -3.3936221 -1.5071564 -1.3054362 debye
polarizability: 304.223749|16.396185|172.0078056|-14.293645|23.5469495|153.5157109 unknown
InChI: InChI=1S/C14H12N2O6/c1-9-3-5-13(14(7-9)21-2)22-12-6-4-10(15(17)18)8-11(12)16(19)20/h3-8H,1-2H3
charge 0 multiplicity 1
34 atoms
O  -0.7262 0.79273 0.93917
O  -1.272949 0.50125 -1.751453
O  2.486148 3.293758 0.979977
O  0.650668 2.734782 2.217431
O  4.534335 -2.431415 -0.728943
O  5.451279 -0.447207 -0.066242
N  1.583403 2.456283 1.376811
N  4.442044 -1.22708 -0.267077
C  -1.919731 0.12764 0.516604
C  0.515099 0.260795 0.64213
C  -2.247125 0.035603 -0.865876
C  -4.425893 -0.940842 -0.247638
C  1.671429 1.075468 0.843008
C  -3.499282 -0.507444 -1.232915
C  -2.8285 -0.283186 1.501134
C  -4.078362 -0.823329 1.119766
C  0.692304 -1.05922 0.147549
C  2.956314 0.599316 0.529057
C  3.093172 -0.714445 0.048855
C  1.9696 -1.553754 -0.139977
C  -5.776523 -1.495374 -0.666132
C  -1.598363 0.518339 -3.18294
H  -3.770287 -0.589285 -2.290724
H  -2.552034 -0.165873 2.553109
H  -4.784943 -1.147096 1.890824
H  -0.189104 -1.688299 -0.003416
H  3.82994 1.243153 0.65804
H  2.118763 -2.571169 -0.510174
H  -5.679043 -2.227661 -1.48804
H  -6.283969 -1.995922 0.175558
H  -6.44395 -0.68847 -1.024851
H  -2.487306 1.147144 -3.378368
H  -1.767789 -0.505377 -3.567748
H  -0.715547 0.957287 -3.668708
