program: Gaussian 09
title: 000243235
version: EM64L-G09RevD.01
frameworkgroup: C1[X(C19H18N6)]
method: RPBEPBE
basis: SDD
operation: Freq
keyword: #pfreq=noraman
keyword: PBEPBE/SDD
title: #p freq=noraman PBEPBE/SDD
converged: YES YES NO NO
title: Mulliken charges:
elementType: N N N N N N C C C C C C C C C C C C C C C C C C C H H H H H H H H H H H H H H H H H H
charge: -0.281304 -0.272463 -0.082810 -0.076364 -0.008973 -0.005694 -0.197607 -0.132158 -0.168637 -0.215741 -0.547265 -0.357089 -0.342040 0.394754 0.420012 -0.350773 -0.345384 -0.375289 -0.383115 -0.233509 -0.233537 -0.201441 -0.197980 -0.259310 -0.255318 0.288887 0.279747 0.307725 0.290929 0.241742 0.276160 0.311342 0.278863 0.255608 0.240407 0.278746 0.283162 0.226162 0.228675 0.227703 0.230588 0.229679 0.232911
chargesum: 0.00000
title: Mulliken charges with hydrogens summed into heavy atoms:
elementType: N N N N N N C C C C C C C C C C C C C C C C C C C
charge: -0.281304 -0.272463 -0.082810 -0.076364 -0.008973 -0.005694 0.091279 0.147589 0.139089 0.075188 -0.029362 -0.045747 -0.063178 0.394754 0.420012 -0.095166 -0.104977 -0.096543 -0.099953 -0.007347 -0.004862 0.026262 0.032608 -0.029631 -0.022407
polarizability: 2.42457075e+02 2.85851778e-01 3.24065791e+02 1.88629285e+01 1.34137199e+01 1.56841917e+02
1716.lowfreq: -3.8057 -0.0008 -0.0001 0.0003 3.8764 7.1692 25.0623 29.3355 48.2483
frequency: 25.0077 29.3140 48.2098 54.9642 77.1005 115.7003 138.6268 149.9150 165.6178 208.6341 246.5883 255.9089 282.1862 315.6545 345.8117 371.1161 394.3864 407.3442 409.4484 426.4051 464.4520 491.8252 507.4719 515.4330 544.8169 551.8646 611.7792 613.2923 620.7512 645.6173 680.4725 694.8472 698.0038 730.3242 734.6070 759.8377 759.9852 803.0325 819.4838 832.6154 835.3437 842.4811 864.1102 864.9648 873.3414 894.6007 895.5021 903.9406 907.3358 921.2761 925.8010 957.6601 970.4659 972.2763 976.1266 978.6472 982.0181 983.3692 986.0705 991.7806 994.3620 1003.0268 1013.3025 1027.3793 1028.2141 1054.4828 1062.8111 1072.0663 1094.5917 1096.6495 1119.7944 1144.3029 1156.4425 1171.9537 1173.1382 1176.2702 1189.5228 1192.0410 1215.1910 1237.7427 1240.3949 1257.1280 1260.3939 1271.5287 1281.8389 1300.5374 1306.6274 1322.8121 1325.9839 1329.3840 1349.1654 1351.3939 1377.1123 1379.4126 1394.8113 1398.9948 1449.7604 1450.7408 1486.8487 1489.5325 1492.3454 1587.1181 1587.2631 1612.1856 1614.6583 3024.5002 3028.6443 3051.5567 3055.2131 3079.5934 3087.7176 3097.5832 3113.0456 3128.3566 3130.3773 3137.2878 3139.3266 3151.5046 3153.6770 3165.8090 3167.7990 3182.9303 3184.1340
redmass: 5.3124 6.4744 3.9951 3.9940 5.0148 5.0282 5.5027 7.3148 5.5771 4.8071 6.1388 5.4401 6.2164 5.7945 5.8688 5.6545 6.8749 2.9946 2.9634 2.8264 4.6974 4.1848 3.2634 3.7735 5.0017 7.3793 6.4222 6.4517 6.8346 6.8678 6.1423 2.0232 2.0810 5.6941 5.0270 1.6582 1.6566 4.3376 3.1474 1.5359 2.3443 1.4892 2.9240 6.2554 4.4038 3.9332 4.4886 1.4276 1.4641 3.8949 3.2710 2.3511 1.3926 1.5742 2.1786 3.8496 5.1108 5.0860 3.6664 1.3112 1.3111 1.8408 1.7226 2.2231 2.1007 3.2845 2.8723 1.4090 1.6894 1.6760 1.1618 2.0092 2.1952 1.1101 1.0694 1.6330 1.1211 1.1303 1.3965 1.4333 1.4406 1.4066 1.3693 1.4333 1.6325 1.5525 1.3254 1.4434 1.3617 1.4132 3.9062 3.5371 5.6063 5.8129 8.8575 7.7788 2.4733 2.4912 1.1207 2.5437 2.5894 6.4485 6.4341 6.1239 6.0829 1.0853 1.0627 1.0869 1.0873 1.0873 1.0896 1.1054 1.0916 1.0849 1.0851 1.0890 1.0890 1.0937 1.0935 1.0988 1.0987 1.0962 1.0963
irintensity: 0.0761 0.9867 0.0374 0.4454 0.1479 0.4452 2.5776 9.4354 1.8252 2.7965 1.4237 0.9452 0.1432 0.4065 0.8411 0.6594 0.3100 0.0162 0.1554 1.2117 2.3728 6.8412 4.5737 10.3295 4.0988 2.2153 1.0713 1.0050 2.3924 3.0090 6.3671 45.8254 23.4674 4.9632 2.9925 111.9200 54.3090 34.0777 1.4797 0.9548 1.1739 0.8144 12.6550 7.0687 35.8078 200.2983 9.4226 10.6650 6.0134 20.9092 3.9520 41.0669 0.9755 5.9172 19.7177 8.2041 0.0797 24.5870 2.1926 1.1466 1.1937 11.1996 2.8154 24.4467 44.8429 27.7806 36.3354 0.8129 27.9247 38.1988 4.1867 3.9512 4.7512 1.1051 0.4698 6.6405 0.7707 0.8002 25.0327 4.0609 27.4705 9.4915 5.3076 17.7982 9.9602 4.1877 0.3102 8.2650 5.2233 8.5808 36.4109 80.0311 20.6872 48.4165 31.9500 97.9197 4.8607 6.7741 21.6090 63.9013 174.5074 4.7129 3.6685 51.2743 119.4553 7.1313 27.4756 4.2478 26.2655 7.8843 15.6250 19.9201 15.4418 2.6622 4.6409 11.2660 8.3771 30.6387 30.0566 16.5290 18.0623 3.4511 2.4363
temp: 298.150 k
press: 1.00000 atm
elementType: 7 7 7 7 7 7 6 6 6 6 6 6 6 6 6 6 6 6 6 6 6 6 6 6 6 1 1 1 1 1 1 1 1 1 1 1 1 1 1 1 1 1 1
symmnumber: 1
zpe: 892987.7 jmol-1
zpe.correction: 0.340121 hartree
zpe.thermalcorrener: 0.358597 hartree
zpe.thermalcorrenthalpy: 0.359541 hartree
zpe.thermalcorrgfe: 0.292276 hartree
zpe.sumelectzpe: -1061.478828 hartree
zpe.sumelectthermal: -1061.460353 hartree
zpe.sumelectthermalent: -1061.459408 hartree
zpe.sumelectthermalfe: -1061.526674 hartree
dipole: -1.3718 2.8093 4.1392
dipole: 5.1873
quadrupole: -154.1338 -142.9903 -144.1171
quadrupole: 1.9293 0.2859 -10.1599
quadrupole: -7.0534 4.0901 2.9633 1.9293 0.2859 -10.1599
hfenergy: -1061.8189494 hartree
pointgroup: C01 [X(C19H18N6)]
dipole: 0.4585376 0.9801696 -1.7303097 debye
polarizability: 244.7497469|2.3031832|321.5737862|11.8534085|-24.5905228|157.0412498 unknown
InChI: InChI=1S/C19H18N6/c1-3-7-12(8-4-1)24-18-15-11-14(16(18)20-22-24)17-19(15)25(23-21-17)13-9-5-2-6-10-13/h1-10,14-19H,11H2
charge 0 multiplicity 1
43 atoms
N  -1.983195 -0.537816 0.587222
N  2.294664 -0.677531 -0.187855
N  -1.987073 -2.671927 1.294643
N  2.311602 -2.74661 0.702516
N  -2.731562 -1.631034 1.082685
N  2.737993 -1.529805 0.85638
C  -0.124783 -1.034359 -1.088947
C  -0.05314 -3.186867 -0.278651
C  -0.549371 -0.878878 0.408583
C  1.402374 -1.382623 -1.135016
C  -0.728983 -2.423146 -1.455402
C  -0.536488 -2.359279 0.944581
C  1.449567 -2.844688 -0.544438
C  -2.590588 0.720945 0.370234
C  2.69783 0.676924 -0.235624
C  -1.796533 1.836711 -0.012151
C  2.229397 1.518445 -1.281462
C  -3.994915 0.879556 0.534812
C  3.57254 1.205669 0.75426
C  -2.406067 3.091884 -0.226157
C  2.635925 2.869656 -1.333869
C  -4.584826 2.13863 0.313976
C  3.963154 2.556581 0.688238
C  -3.800522 3.254178 -0.06919
C  3.501266 3.400219 -0.35181
H  -0.422788 -0.189666 -1.727759
H  -0.264181 -4.261108 -0.187887
H  0.089888 -0.179378 0.970904
H  1.792224 -1.302259 -2.16444
H  -0.407301 -2.782795 -2.448066
H  -1.830355 -2.444833 -1.411434
H  0.073509 -2.536592 1.84347
H  1.910225 -3.593819 -1.209271
H  -0.711759 1.740415 -0.125838
H  1.562823 1.125432 -2.055806
H  -4.596681 0.019203 0.837273
H  3.932042 0.552519 1.552899
H  -1.781315 3.945597 -0.512064
H  2.272544 3.506038 -2.148518
H  -5.667175 2.250087 0.444238
H  4.636721 2.954157 1.455543
H  -4.268105 4.229828 -0.237343
H  3.812419 4.448937 -0.394758
