program: Gaussian 09
title: 000243225
version: EM64L-G09RevD.01
frameworkgroup: C1[X(C12H6N4O9)]
method: RPBEPBE
basis: SDD
operation: Freq
keyword: #p
keyword: freq=noraman
keyword: PBEPBE/SDD
title: #p freq=noraman PBEPBE/SDD
converged: YES YES NO NO
title: Mulliken charges:
elementType: O O O O O O O O O N N N N C C C C C C C C C C C C H H H H H H
charge: -0.263099 -0.161020 -0.161120 -0.149647 -0.149700 -0.169961 -0.169940 -0.205928 -0.204943 0.015533 0.015545 0.022352 0.024746 0.077988 0.368941 0.368967 0.479717 -0.526436 -0.526552 0.479609 -0.289140 -0.368227 0.385495 -0.354498 -0.325104 0.341010 0.341074 0.246380 0.272397 0.290865 0.294695
chargesum: 0.00000
title: Mulliken charges with hydrogens summed into heavy atoms:
elementType: O O O O O O O O O N N N N C C C C C C C C C C C C
charge: -0.263099 -0.161020 -0.161120 -0.149647 -0.149700 -0.169961 -0.169940 -0.205928 -0.204943 0.015533 0.015545 0.022352 0.024746 0.077988 0.368941 0.368967 0.479717 -0.185426 -0.185478 0.479609 -0.042760 -0.095830 0.385495 -0.063632 -0.030409
polarizability: 3.32209747e+02 -1.65004259e-02 1.75539531e+02 -1.24429797e+01 -4.10950429e-03 1.41332574e+02
1716.lowfreq: -6.0276 -3.7979 0.0004 0.0005 0.0009 3.2540 12.6027 23.8523 28.5278
frequency: 12.4686 23.8487 28.4340 44.5433 50.1493 54.6204 73.0767 81.4846 103.2466 118.9218 142.0101 150.6400 175.5214 189.2514 250.5164 250.9265 297.5162 302.4336 309.6462 332.5329 351.7218 363.4661 390.4826 413.1765 447.9157 481.8215 494.8221 512.6687 516.5075 532.5148 585.0185 624.0026 634.1062 648.7936 657.4776 671.2622 676.3937 711.1822 718.8992 720.5594 724.5385 742.0085 783.2247 798.0023 820.0574 840.9410 849.8251 861.4063 896.4246 958.8467 961.6441 975.2285 988.2407 998.3559 1070.9600 1094.6691 1107.2106 1141.3018 1153.5911 1176.9308 1179.9344 1200.0562 1202.6319 1213.6724 1224.5484 1241.0718 1286.7453 1363.5148 1364.1906 1378.3441 1380.4888 1396.9932 1412.3187 1422.9555 1424.4009 1448.0538 1469.4769 1586.7695 1594.7239 1603.3810 1617.0166 3159.1454 3176.8524 3182.5069 3183.5256 3188.1179 3194.4977
redmass: 12.9402 13.4466 6.6510 12.7567 15.7079 15.7010 6.6204 11.9992 8.6130 10.2005 14.4980 12.7322 6.0406 11.5789 8.8704 8.7507 8.1863 8.3749 15.0602 11.6823 9.9227 11.0405 9.9480 2.9470 6.1240 3.2632 10.1208 6.0581 8.8917 7.3518 5.3861 7.2202 11.5942 5.8961 4.5813 11.6853 10.8258 5.9074 7.8591 9.2288 5.1016 15.1528 8.8844 7.3037 1.2894 8.0480 1.6471 8.6003 8.7773 1.3966 1.6317 1.3395 1.3487 3.0426 1.8068 3.1565 1.2477 5.0819 2.2538 1.8774 1.5781 11.9778 8.2064 8.0390 9.0645 6.3206 1.2661 5.4912 8.4228 12.7324 7.9256 13.7740 11.3181 7.2694 4.0885 4.6818 2.4532 9.8117 7.0840 7.8563 8.1113 1.0905 1.0897 1.0924 1.0936 1.0954 1.0975
irintensity: 0.4958 0.2346 0.0895 0.0152 0.2836 0.0338 0.1657 3.7081 4.9423 6.8202 3.0685 6.8616 0.3475 0.7899 1.4954 2.4500 0.0228 0.5162 0.0498 0.1639 1.2300 2.0180 1.4444 0.0025 0.3773 6.0125 3.8068 2.6081 2.2894 8.7812 3.2762 2.6791 3.5384 2.8868 14.1436 41.4292 39.5419 16.9099 1.6742 0.8990 11.7871 11.2630 37.9016 9.3369 4.6680 28.8152 44.4110 38.9374 55.1150 1.8478 40.5580 5.1252 0.0883 20.8469 85.2087 7.0570 23.7839 5.7194 326.8791 1.5512 1.4833 91.1912 285.3598 715.8253 129.2817 163.6633 0.7711 53.3651 97.7908 17.3290 128.6524 30.3817 7.6029 35.9470 43.9873 385.9499 62.7153 23.6194 247.8681 12.7180 9.4966 10.0737 0.1647 33.2871 20.8344 4.0986 6.0678
temp: 298.150 k
press: 1.00000 atm
elementType: 8 8 8 8 8 8 8 8 8 7 7 7 7 6 6 6 6 6 6 6 6 6 6 6 6 1 1 1 1 1 1
symmnumber: 1
zpe: 485587.7 jmol-1
zpe.correction: 0.184951 hartree
zpe.thermalcorrener: 0.206230 hartree
zpe.thermalcorrenthalpy: 0.207174 hartree
zpe.thermalcorrgfe: 0.130425 hartree
zpe.sumelectzpe: -1354.754002 hartree
zpe.sumelectthermal: -1354.732722 hartree
zpe.sumelectthermalent: -1354.731778 hartree
zpe.sumelectthermalfe: -1354.808528 hartree
dipole: -3.6275 0.0023 -0.9793
dipole: 3.7573
quadrupole: -194.4676 -161.0940 -138.0955
quadrupole: -0.0033 -7.5532 0.0058
quadrupole: -29.9152 3.4584 26.4569 -0.0033 -7.5532 0.0058
hfenergy: -1354.9389524 hartree
pointgroup: C01 [X(C12H6N4O9)]
dipole: -1.4223532 0.0011131 -0.4026695 debye
polarizability: 332.4847357|0.0325335|175.5394865|-10.1124809|0.0397761|141.0576298 unknown
InChI: InChI=1S/C12H6N4O9/c17-13(18)7-1-3-9(4-2-7)25-12-10(15(21)22)5-8(14(19)20)6-11(12)16(23)24/h1-6H
charge 0 multiplicity 1
31 atoms
O  0.266661 0.003417 -1.279194
O  -1.811881 3.487866 -0.976312
O  -1.80952 -3.486497 -0.982903
O  0.250863 2.651424 -0.457122
O  0.253919 -2.648318 -0.469587
O  -5.529187 1.138978 1.167314
O  -5.527738 -1.1469 1.164524
O  5.573995 -0.001845 2.29289
O  6.457324 0.000069 0.188157
N  -1.019161 2.538819 -0.617835
N  -1.016844 -2.537061 -0.625315
N  -4.977451 -0.003353 0.951583
N  5.4580 -0.000596 1.006173
C  -0.936905 0.001049 -0.591732
C  -1.643283 1.213742 -0.339174
C  -1.641769 -1.21323 -0.34236
C  -3.587136 -0.001797 0.411439
C  -2.958394 1.227785 0.154228
C  -2.956839 -1.229922 0.151212
C  1.539858 0.002055 -0.636692
C  1.68707 0.000647 0.765219
C  2.641871 0.002719 -1.513754
C  4.092969 0.000338 0.432857
C  2.984236 -0.000248 1.307165
C  3.938558 0.001842 -0.971785
H  -3.483057 2.172976 0.320297
H  -3.48035 -2.176181 0.314823
H  0.815614 0.000357 1.426321
H  2.473748 0.003836 -2.593384
H  3.153028 -0.001338 2.386887
H  4.8251 0.002266 -1.610442
