program: Gaussian 09
title: 000243208
version: EM64L-G09RevD.01
frameworkgroup: C1[X(C10H16O2)]
method: RPBEPBE
basis: SDD
operation: Freq
keyword: #pfreq=noraman
keyword: PBEPBE/SDD
title: #p freq=noraman PBEPBE/SDD
converged: YES YES NO NO
title: Mulliken charges:
elementType: O O C C C C C C C C C C H H H H H H H H H H H H H H H H
charge: -0.243938 -0.244603 -0.077524 -0.037272 -0.466043 -0.479065 -0.448535 -0.204794 -0.379951 -0.310900 -0.312376 -0.192232 0.252062 0.180602 0.195886 0.242695 0.244389 0.200231 0.209187 0.214417 0.199357 0.234093 0.199368 0.180291 0.232037 0.231594 0.181012 0.200011
chargesum: 0.00000
title: Mulliken charges with hydrogens summed into heavy atoms:
elementType: O O C C C C C C C C C C
charge: -0.243938 -0.244603 0.174539 0.143330 -0.027462 -0.034445 -0.024931 -0.005437 0.053510 0.101428 0.100230 0.007780
polarizability: 1.33584231e+02 4.73954929e+00 1.10085137e+02 2.58940440e+00 2.26864211e+00 8.10395119e+01
1716.lowfreq: -11.5060 -0.0010 -0.0008 -0.0003 1.9189 10.2343 54.2940 76.9740 117.9334
frequency: 54.2388 76.9413 117.9311 150.2954 193.1380 247.3058 265.5808 315.2678 368.8524 382.4347 412.4628 447.5929 479.5467 497.5819 551.4348 606.7514 656.7700 744.0271 810.8764 834.7810 856.3561 866.6552 885.0621 898.6326 920.5750 921.7490 929.2137 959.5563 970.1193 973.3192 1047.0044 1056.8902 1062.7806 1069.3241 1101.9031 1115.2265 1132.9351 1143.8036 1188.1852 1200.0160 1212.8410 1215.3123 1244.3101 1260.3836 1279.6208 1294.7464 1313.2499 1330.3328 1332.8567 1340.2426 1346.8138 1356.4727 1363.8851 1379.3278 1383.8627 1439.1285 1456.4566 1457.6244 1460.0859 1469.5911 1475.9283 1674.5343 2855.7479 2929.3908 2935.8373 2941.8633 2954.5722 2970.6189 2997.9354 3002.3731 3009.4893 3036.0266 3064.5545 3069.9898 3084.8602 3088.8315 3090.4045 3121.8108
redmass: 3.2818 3.3465 4.0710 2.5296 2.0614 2.8705 5.0471 1.8360 4.2726 2.1696 1.9862 5.4265 2.6618 3.9388 4.0190 2.5575 1.2320 1.9190 3.0234 2.1605 4.0971 3.1496 1.6749 3.0395 1.8719 2.3152 2.5129 3.1209 2.2617 1.2787 2.2308 3.4148 2.1835 1.7533 2.0096 2.3377 1.1502 1.7961 1.1424 1.2488 1.3350 1.4291 1.2148 1.2054 1.2398 1.3146 1.1472 1.5600 1.4629 1.4162 1.4860 1.2134 1.2973 1.5759 1.7716 1.0938 1.0970 1.0865 1.0772 1.0979 1.0911 6.3859 1.0819 1.0693 1.0691 1.0691 1.0637 1.0676 1.0618 1.0865 1.0892 1.0905 1.0970 1.0990 1.0941 1.0837 1.0979 1.0993
irintensity: 0.2798 1.6017 1.5091 4.0522 1.1439 1.8748 0.8561 5.2104 7.6780 0.2818 1.4154 2.9233 0.2458 1.4105 5.0036 4.6887 51.5248 4.2681 2.7018 6.7521 45.6612 3.7969 30.2978 8.2094 3.3766 31.2870 15.2600 36.9374 9.7520 0.9349 0.7726 118.4439 21.8131 22.3619 1.3744 45.1640 7.6050 2.8067 0.1639 0.5438 17.9550 6.3337 17.5208 0.8142 10.5178 2.4317 3.1820 0.8932 1.8940 4.6930 23.0478 1.0871 13.2307 0.7250 10.6298 12.6222 0.9735 5.0397 20.6888 10.4375 9.3477 5.7450 64.4203 24.6358 112.2212 40.3744 42.5458 20.7708 38.5515 9.0852 60.3300 25.8973 31.2371 31.7850 39.1627 10.0916 35.3533 74.5927
temp: 298.150 k
press: 1.00000 atm
elementType: 8 8 6 6 6 6 6 6 6 6 6 6 1 1 1 1 1 1 1 1 1 1 1 1 1 1 1 1
symmnumber: 1
zpe: 638536.9 jmol-1
zpe.correction: 0.243206 hartree
zpe.thermalcorrener: 0.254284 hartree
zpe.thermalcorrenthalpy: 0.255228 hartree
zpe.thermalcorrgfe: 0.206276 hartree
zpe.sumelectzpe: -540.122857 hartree
zpe.sumelectthermal: -540.111779 hartree
zpe.sumelectthermalent: -540.110835 hartree
zpe.sumelectthermalfe: -540.159787 hartree
dipole: 2.2472 -0.1615 1.4569
dipole: 2.6830
quadrupole: -61.6635 -73.6898 -73.6560
quadrupole: 0.9050 2.4089 0.4790
quadrupole: 8.0063 -4.0201 -3.9862 0.9050 2.4089 0.4790
hfenergy: -540.3660632 hartree
pointgroup: C01 [X(C10H16O2)]
dipole: -0.8840983 -0.0594179 -0.5736735 debye
polarizability: 133.4708737|-4.9686113|110.1445387|2.6745444|-2.5876852|81.0934674 unknown
InChI: InChI=1S/C10H16O2/c1-2-5-9(6-3-1)10-11-7-4-8-12-10/h1-2,9-10H,3-8H2
charge 0 multiplicity 1
28 atoms
O  -1.415306 1.205126 0.259024
O  -1.418596 -1.212746 0.209417
C  0.690882 -0.005681 0.178302
C  -0.767651 0.00553 -0.279291
C  1.447092 -1.239586 -0.373351
C  1.412671 1.300571 -0.23815
C  2.875523 -1.312521 0.214506
C  2.91498 1.206223 -0.037928
C  -3.578782 -0.002735 0.323787
C  -2.833329 1.259513 -0.153809
C  -2.836725 -1.246788 -0.204456
C  3.572724 0.037093 0.184488
H  0.676389 -0.067395 1.284628
H  -0.861395 0.029387 -1.396749
H  1.512482 -1.158467 -1.478236
H  0.883682 -2.160306 -0.141767
H  1.001652 2.150235 0.337487
H  1.192323 1.52946 -1.304584
H  3.477023 -2.055279 -0.347202
H  2.836235 -1.686463 1.260006
H  3.480439 2.1484 -0.069888
H  -3.594439 -0.024947 1.427884
H  -4.624408 0.006031 -0.041985
H  -2.889523 1.342262 -1.263307
H  -3.236616 2.180283 0.296289
H  -3.242126 -2.183825 0.208698
H  -2.893906 -1.284822 -1.31632
H  4.659506 0.048848 0.349508
