program: Gaussian 09
title: 000243211
version: EM64L-G09RevD.01
frameworkgroup: C1[X(C9H9Cl2NO2)]
method: RPBEPBE
basis: SDD
operation: Freq
keyword: #p
keyword: freq=noraman
keyword: PBEPBE/SDD
title: #p freq=noraman PBEPBE/SDD
converged: YES YES NO NO
title: Mulliken charges:
elementType: Cl Cl O O N C C C C C C C C C H H H H H H H H H
charge: 0.027264 0.006626 -0.319228 -0.236985 -0.395210 0.327056 0.183334 -0.322089 -0.321036 -0.234757 -0.241893 0.341097 -0.728654 -0.525694 0.306158 0.366365 0.242725 0.231384 0.228694 0.359852 0.228150 0.228490 0.248350
chargesum: 0.00000
title: Mulliken charges with hydrogens summed into heavy atoms:
elementType: Cl Cl O O N C C C C C C C C C
charge: 0.027264 0.006626 -0.319228 -0.236985 -0.028844 0.327056 0.183334 -0.015931 -0.078311 -0.003373 -0.013199 0.341097 -0.368802 0.179296
polarizability: 1.79951776e+02 -3.67016532e+00 1.45406576e+02 5.17188964e-01 5.06273641e-01 8.36279868e+01
1716.lowfreq: -10.6141 -7.2326 -6.7039 0.0025 0.0027 0.0041 8.3481 45.7719 75.0182
frequency: 5.4405 45.7298 75.0146 79.1404 100.0115 150.7390 162.4633 198.0523 216.7050 242.2945 247.3987 303.6578 317.3046 384.6063 456.0290 462.3048 485.8896 554.5291 564.8619 591.3399 656.9166 699.6356 727.1468 745.8727 753.8221 764.4560 768.4399 848.1308 856.2321 941.8245 947.5100 985.1504 994.9260 1040.9709 1109.9297 1117.1531 1151.8393 1175.5660 1187.7474 1191.3640 1204.7761 1225.8677 1258.8529 1306.6139 1395.7828 1429.5200 1451.5128 1466.5761 1467.8917 1485.1688 1520.9794 1602.3513 1611.0669 1617.4021 2969.4863 3061.3271 3131.7257 3139.1379 3156.8102 3165.2980 3171.4404 3195.5171 3455.5633
redmass: 9.7662 9.9536 4.6093 7.5935 3.8570 5.7459 8.0938 1.8387 4.0776 3.1553 5.0237 4.8569 4.1866 15.1498 3.6951 5.5338 5.9038 4.0750 5.4952 7.8509 6.0215 5.6607 2.7365 7.3486 1.3807 5.7512 1.3336 5.8328 1.3950 1.3538 6.1439 1.3050 8.6682 2.0699 2.0515 1.2567 1.3935 1.0649 1.1106 1.7741 2.0884 1.8399 1.9895 1.7407 7.6368 1.4312 1.9133 1.0574 1.2649 1.7107 2.2522 5.5631 5.8962 9.2624 1.0324 1.1046 1.1001 1.0861 1.0914 1.0897 1.0976 1.0956 1.0764
irintensity: 1.0019 1.1871 0.0104 0.5848 8.7582 6.1546 4.8160 0.1430 2.3586 1.8273 1.5992 1.7065 1.8273 2.5507 19.5243 37.7541 1.9656 9.7183 6.2111 75.0478 11.5628 57.2146 1.1962 52.4487 23.4718 24.0014 165.2544 5.3699 1.4361 7.9249 2.3695 2.6044 50.6592 20.4092 49.2868 0.2067 0.2089 2.4195 9.7970 2.8245 56.2181 14.1054 85.2418 11.8941 3.6064 40.6729 47.5836 17.6408 91.1971 29.7700 301.6549 93.9777 37.2066 219.9322 60.7694 39.4994 16.3049 1.0959 19.1307 0.8136 16.4153 4.8079 67.8018
temp: 298.150 k
press: 1.00000 atm
elementType: 17 17 8 8 7 6 6 6 6 6 6 6 6 6 1 1 1 1 1 1 1 1 1
symmnumber: 1
zpe: 435433.6 jmol-1
zpe.correction: 0.165848 hartree
zpe.thermalcorrener: 0.179786 hartree
zpe.thermalcorrenthalpy: 0.180730 hartree
zpe.thermalcorrgfe: 0.121639 hartree
zpe.sumelectzpe: -1472.643110 hartree
zpe.sumelectthermal: -1472.629172 hartree
zpe.sumelectthermalent: -1472.628228 hartree
zpe.sumelectthermalfe: -1472.687319 hartree
dipole: 3.5494 3.3774 0.0888
dipole: 4.9003
quadrupole: -85.2066 -89.8617 -99.8095
quadrupole: 5.6445 2.3414 1.2087
quadrupole: 6.4193 1.7642 -8.1836 5.6445 2.3414 1.2087
hfenergy: -1472.8089581 hartree
pointgroup: C01 [X(C9H9Cl2N1O2)]
dipole: -1.5392564 -1.1046798 0.3567711 debye
dipolederiv: -0.4124867 0.0394446 -0.1559107 0.1353758 -0.1433802 0.0303986 -0.4274584 -0.0283858 -0.6038197 -0.2609592 0.0114401 -0.0306723 0.2454667 -0.5870963 -0.3757586 0.07355 -0.2535266 -0.3460278 -0.3329211 0.0957508 -0.0146694 -0.2165951 -1.5230378 0.3133802 0.0614048 0.2689148 -0.3503051 -0.7204929 0.1209439 0.0379751 -0.7198955 -0.8007464 0.2656936 0.2109017 0.1252969 -0.3651892 -1.5051691 -0.0258488 0.195588 -0.3115607 -0.4295893 0.0951135 0.2818479 0.0601842 -0.2992175 0.806814 -0.2498862 -0.0672157 -0.1703843 -0.143039 0.070624 -0.0771391 0.08737 0.0515731 -0.1174523 -0.3632681 0.1083321 -0.012254 1.157781 -0.2418783 0.0376844 -0.1894674 0.0889366 -0.0214966 -0.0298199 -0.0150877 -0.0121224 -0.027072 -0.0269904 -0.0230923 -0.0213034 -0.1338956 0.0009249 0.2341439 -0.0850078 -0.0216544 -0.1664085 -0.0005074 -0.028869 -0.0451617 -0.1716521 -0.2065348 -0.0033611 0.0014512 -0.1528419 0.0571843 -0.0303452 0.0378726 -0.0531634 -0.1719152 0.0353325 -0.0547807 -0.0228426 0.1507626 0.0422698 -0.0679525 -0.0676018 -0.0365359 -0.140093 1.4459173 -0.0626709 -0.1761696 1.0737247 0.8419994 -0.4377731 -0.3644124 -0.2481539 0.1749487 0.5626233 0.0244942 0.2085066 -0.2702851 0.7131496 0.4034047 0.3081116 0.347229 1.0444791 0.3646823 0.3863213 -0.0911696 0.2141609 0.6942088 -0.1186448 -0.0576769 -0.1519111 0.3621776 0.1142777 -0.0644003 0.0278454 -0.0444515 0.0995622 0.0246657 0.0220155 0.029657 0.1696788 0.2957342 0.0284295 -0.0113411 0.0606117 0.2430922 0.005764 -0.0526423 0.0040572 0.2936967 0.0176842 -0.0842416 0.0440821 -0.1000078 -0.000464 0.0543954 0.0477731 0.0523074 0.1471921 0.0606638 0.0491378 0.0059168 0.073696 -0.0878086 0.0457731 0.0015504 0.0492799 0.1528393 -0.1046819 0.0662541 0.0297533 0.0532265 0.0735968 0.0114071 0.033665 0.0090972 0.1553907 0.0104796 0.0316366 -0.0215358 -0.0368762 0.0048892 -0.0075712 -0.003335 -0.027894 -0.023819 -0.0724038 -0.1570563 -0.0747386 -0.0083302 0.0365956 0.0238677 -0.1095855 -0.0185099 -0.0475032 -0.0026519 -0.1066493 0.1178442 0.0228553 0.0246982 -0.0754365 0.092418 0.0151358 -0.1039976 0.0421165 0.1139862 -0.010934 0.0473791 -0.0803849 0.0383705 0.0030177 0.0254834 0.1165221 unknown
polarizability: 177.5056127|-9.1895563|145.5190693|-8.499132|-8.9589938|85.9616569 unknown
InChI: InChI=1S/C9H9Cl2NO2/c1-14-7-5-3-2-4-6(7)12-9(13)8(10)11/h2-5,8,12H,1H3
charge 0 multiplicity 1
23 atoms
Cl 3.786093 -0.489369 1.310362
Cl 3.086983 -1.931466 -1.315123
O  -1.021754 -1.929567 0.543916
O  1.96605 1.762272 -0.82146
N  0.778157 -0.165218 -0.153388
C  -0.54867 0.325419 -0.045382
C  -1.535435 -0.635498 0.338681
C  -0.936329 1.664424 -0.28369
C  -2.884923 -0.261732 0.484137
C  -2.293031 2.034725 -0.137097
C  -3.261436 1.082157 0.243916
C  1.906058 0.535572 -0.503722
C  3.21951 -0.257866 -0.464994
C  -1.954212 -2.985296 0.944348
H  -0.177922 2.39164 -0.579104
H  0.872793 -1.170027 0.044723
H  -3.640163 -0.995722 0.779738
H  -2.587466 3.072584 -0.322759
H  -4.310547 1.37534 0.355851
H  4.011818 0.299632 -0.976139
H  -2.731033 -3.141077 0.171868
H  -2.430158 -2.745839 1.914111
H  -1.339882 -3.89169 1.044008
