program: Gaussian 09
title: 000243209
version: EM64L-G09RevD.01
frameworkgroup: C1[X(C12H19NO4)]
method: RPBEPBE
basis: SDD
operation: Freq
keyword: #p
keyword: freq=noraman
keyword: PBEPBE/SDD
title: #p freq=noraman PBEPBE/SDD
converged: YES YES NO NO
title: Mulliken charges:
elementType: O O O O N C C C C C C C C C C C C H H H H H H H H H H H H H H H H H H H
charge: -0.221416 -0.223016 -0.207759 -0.188879 0.113076 -0.094740 0.305399 -0.034404 -0.464726 -0.381722 -0.404883 -0.478440 -0.410864 -0.449582 -0.204903 -0.190489 -0.701992 0.260655 0.187565 0.276472 0.184880 0.187521 0.277237 0.196643 0.242151 0.246721 0.198822 0.239020 0.210315 0.211151 0.217924 0.201784 0.202541 0.243288 0.227091 0.227557
chargesum: 0.00000
title: Mulliken charges with hydrogens summed into heavy atoms:
elementType: O O O O N C C C C C C C C C C C C
charge: -0.221416 -0.223016 -0.207759 -0.188879 0.113076 0.165916 0.305399 0.153162 -0.025932 0.079630 0.059875 -0.032897 0.038472 -0.020506 -0.003119 0.012052 -0.004056
polarizability: 1.72833052e+02 -5.50018534e+00 1.43342638e+02 -5.77129833e+00 -3.45276142e+00 1.16358752e+02
1716.lowfreq: -9.8360 -0.0008 -0.0004 0.0004 5.0486 7.8667 39.4132 41.4055 51.3829
frequency: 39.2880 41.3332 51.3777 67.9575 96.0652 101.0093 158.7864 162.3136 183.4118 194.3421 211.4251 243.7208 287.8283 322.1442 357.0953 365.9565 370.7177 383.7534 414.4736 451.0090 481.3461 495.4575 525.4195 543.0241 555.3876 612.1382 659.5952 680.6561 745.1732 765.3948 776.4061 824.4384 857.4850 867.9707 871.4965 900.7024 909.6384 921.8939 942.8310 962.5624 965.5864 972.9304 975.0728 1022.0027 1055.7089 1061.8808 1069.5678 1072.2184 1099.7294 1100.8397 1128.6377 1136.3236 1147.1629 1193.5742 1201.4665 1216.6015 1220.6011 1236.6544 1246.2031 1260.3617 1278.4297 1297.5131 1308.3472 1314.3909 1329.4696 1332.2534 1334.1021 1347.6438 1354.6175 1374.6723 1379.9229 1382.9491 1403.2185 1411.9366 1440.9054 1445.4637 1457.6250 1461.0710 1465.3385 1476.4456 1483.5712 1485.9051 1676.4800 2862.7369 2940.4849 2941.1813 2949.3655 2956.8875 2970.3817 2990.8912 2994.2743 3005.8563 3012.2155 3034.7701 3045.9024 3063.5193 3088.0700 3092.3951 3094.8644 3111.9944 3124.4816 3125.0026
redmass: 4.3106 4.1318 9.4254 2.6754 3.5927 3.7467 4.1110 3.7256 1.9105 3.7124 1.7142 3.3799 1.9748 3.1088 2.7132 3.4795 4.0482 2.1284 2.0718 4.7966 3.6687 4.0708 4.8238 5.3887 4.4126 5.2951 1.2470 3.9741 1.9153 8.8616 1.4209 2.0587 3.3328 2.9104 3.7763 3.3770 1.7952 1.6669 3.0397 3.3447 2.9483 2.9625 1.2621 2.2364 2.0269 2.1650 2.0016 2.3119 2.6320 2.2988 2.3632 1.1603 2.0025 1.4165 1.8189 1.4187 5.7372 1.2381 1.2254 1.2497 1.2918 1.3124 1.2653 1.1844 1.4401 1.3974 1.5164 1.4944 1.2960 1.3140 1.5909 1.7439 2.3010 1.6478 1.1793 1.0897 1.0981 1.0773 1.1037 1.0910 1.0595 1.0425 6.3993 1.0822 1.0696 1.0689 1.0698 1.0641 1.0668 1.0590 1.0373 1.0865 1.0898 1.0905 1.1014 1.0973 1.0996 1.0838 1.1006 1.0937 1.0928 1.0992
irintensity: 1.1127 1.0234 0.0733 0.4381 0.4440 0.4188 1.4308 1.2205 1.4342 0.3985 0.9278 2.1031 1.7024 2.1029 4.9845 5.8637 1.1371 2.8893 2.6657 0.5414 0.5509 1.7851 5.8179 7.7680 6.8286 9.2241 51.7222 1.2001 3.9783 27.2909 10.4272 0.2467 10.7562 25.4988 59.9439 14.1319 1.2099 10.3464 3.4627 42.7444 8.2080 20.0331 1.1022 58.7970 3.8628 11.5862 38.8729 71.8248 9.3977 4.9448 34.0468 10.4065 0.9220 3.1798 8.8856 3.0168 53.3802 1.0430 20.4108 2.3355 6.0944 2.2559 10.7445 5.7867 0.0346 3.3570 0.7542 19.1726 6.7394 5.3795 1.4666 13.6089 133.1844 30.6002 1.4850 10.2564 0.8307 20.5499 8.4413 8.7745 15.1901 14.1160 5.8365 62.2799 4.2691 39.7008 91.4153 37.8857 23.9393 28.6014 17.1293 7.6348 50.9980 24.5584 5.9938 30.3511 33.8552 8.8795 27.4341 3.8414 7.6229 68.9614
temp: 298.150 k
press: 1.00000 atm
elementType: 8 8 8 8 7 6 6 6 6 6 6 6 6 6 6 6 6 1 1 1 1 1 1 1 1 1 1 1 1 1 1 1 1 1 1 1
symmnumber: 1
zpe: 786148.1 jmol-1
zpe.correction: 0.299428 hartree
zpe.thermalcorrener: 0.316169 hartree
zpe.thermalcorrenthalpy: 0.317114 hartree
zpe.thermalcorrgfe: 0.254453 hartree
zpe.sumelectzpe: -822.870058 hartree
zpe.sumelectthermal: -822.853316 hartree
zpe.sumelectthermalent: -822.852372 hartree
zpe.sumelectthermalfe: -822.915033 hartree
dipole: 0.8412 -1.3768 -5.2512
dipole: 5.4935
quadrupole: -94.9859 -103.9639 -105.6882
quadrupole: -5.6789 -12.0890 -0.7252
quadrupole: 6.5601 -2.4179 -4.1422 -5.6789 -12.0890 -0.7252
hfenergy: -823.1694858 hartree
pointgroup: C01 [X(C12H19N1O4)]
dipole: -0.3350128 0.5239636 -2.0698838 debye
polarizability: 172.6448267|-6.1087125|143.7033122|5.4598869|3.0256591|116.1863029 unknown
InChI: InChI=1S/C12H19NO4/c1-2-12(13(14)15)8-16-11(17-9-12)10-6-4-3-5-7-10/h3-4,10-11H,2,5-9H2,1H3
charge 0 multiplicity 1
36 atoms
O  -0.053789 -1.187384 -0.387489
O  -0.097304 1.144532 0.176282
O  -3.002942 -1.615918 1.300811
O  -2.623199 0.507223 2.018512
N  -2.631293 -0.399514 1.112305
C  2.0338 -0.011981 0.043149
C  -2.260039 -0.000809 -0.354769
C  0.630898 0.099972 -0.547165
C  2.858346 -1.118308 -0.661983
C  -1.398769 -1.135876 -0.96536
C  -1.456587 1.318559 -0.349541
C  2.772977 1.348985 -0.030705
C  -3.607637 0.118431 -1.124274
C  4.222924 -1.309117 0.040261
C  4.251416 1.209711 0.284837
C  4.901179 0.016913 0.336208
C  -4.586558 1.182675 -0.583411
H  1.909427 -0.291557 1.107917
H  0.640878 0.361123 -1.637235
H  -1.85396 -2.117371 -0.768689
H  -1.338484 -0.957738 -2.062201
H  -1.41805 1.689513 -1.398249
H  -1.922998 2.073046 0.297583
H  3.030471 -0.824814 -1.71837
H  2.290895 -2.065366 -0.668615
H  2.299531 2.06419 0.667242
H  2.649106 1.793458 -1.04344
H  -4.09188 -0.876653 -1.114267
H  -3.359048 0.345566 -2.179449
H  4.88588 -1.934827 -0.590233
H  4.085354 -1.875553 0.98585
H  4.803374 2.137746 0.4897
H  5.967392 -0.008894 0.601681
H  -4.868192 0.987796 0.466077
H  -4.163156 2.201275 -0.637492
H  -5.512461 1.175363 -1.184977
