program: Gaussian 09
title: 000243231
version: EM64L-G09RevD.01
frameworkgroup: C1[X(C19H12N2O6)]
method: RPBEPBE
basis: SDD
operation: Freq
keyword: #p
keyword: freq=noraman
keyword: PBEPBE/SDD
title: #p freq=noraman PBEPBE/SDD
converged: YES YES NO NO
title: Mulliken charges:
elementType: O O O O O O N N C C C C C C C C C C C C C C C C C C C H H H H H H H H H H H H
charge: -0.245325 -0.218894 -0.187512 -0.162529 -0.200338 -0.193314 0.010607 0.021218 0.299149 0.332451 0.230847 0.281766 -0.336332 -0.344828 0.015167 -0.386254 -0.360452 0.293003 -0.280006 -0.476317 0.430379 -0.377876 -0.369951 -0.354708 -0.234639 -0.229552 -0.226271 0.278664 0.282299 0.274366 0.272344 0.288254 0.333565 0.296568 0.261822 0.273816 0.234642 0.237017 0.237154
chargesum: 0.00000
title: Mulliken charges with hydrogens summed into heavy atoms:
elementType: O O O O O O N N C C C C C C C C C C C C C C C C C C C
charge: -0.245325 -0.218894 -0.187512 -0.162529 -0.200338 -0.193314 0.010607 0.021218 0.299149 0.332451 0.230847 0.281766 -0.057669 -0.062529 0.015167 -0.111888 -0.088108 0.293003 0.008249 -0.142753 0.430379 -0.081308 -0.108129 -0.080892 0.000003 0.007464 0.010884
polarizability: 4.43413226e+02 -1.05912942e+01 2.05539825e+02 1.59938193e+01 5.52439731e-01 1.78110714e+02
1716.lowfreq: -6.7428 -0.0009 -0.0007 -0.0004 1.7998 2.7835 10.5737 22.0903 32.2222
frequency: 10.2150 22.0680 32.2057 41.6826 50.4368 54.8067 60.7208 87.1217 101.2008 119.1772 136.3675 152.2529 170.2469 178.6887 212.0284 264.5575 283.4170 296.1586 309.2725 335.6723 363.0568 379.1534 398.2731 404.6387 417.3388 426.1257 454.3326 486.9766 493.4733 515.0572 556.5178 576.5248 612.7854 614.7113 617.9496 638.6189 656.0851 666.9628 681.3667 691.7591 705.1925 711.2203 740.8396 744.3352 752.1177 759.8630 800.7063 831.0252 840.4093 847.9048 861.8063 868.6858 888.1563 913.5349 948.3537 951.6634 974.6892 983.9575 989.0809 992.5310 994.1803 1006.8298 1008.4618 1026.9011 1053.8318 1085.3886 1111.3016 1112.6415 1143.8952 1148.3356 1151.4426 1175.9673 1186.6066 1192.0331 1202.8614 1215.7048 1241.1489 1254.9902 1281.3797 1299.0663 1320.2379 1359.7882 1371.8472 1376.0667 1384.3764 1401.1900 1407.8499 1428.0275 1434.0223 1464.2543 1476.2300 1484.0887 1537.6621 1580.0687 1586.9674 1588.4076 1600.3805 1608.0103 1615.6374 3131.1276 3140.2303 3150.3975 3150.8947 3156.7639 3160.8248 3168.2648 3169.8556 3171.4833 3179.0925 3187.3359 3189.9127
redmass: 7.3167 7.9865 6.6180 12.4157 5.4748 10.0997 6.8563 5.1434 6.6265 7.9777 10.6645 5.7118 8.3101 6.5724 6.5058 6.4916 7.1676 8.0104 8.9701 10.7708 7.2230 7.8597 5.2601 3.0539 2.9982 4.1423 4.4093 4.8948 4.9092 5.4882 5.1249 6.0114 6.4087 6.4888 7.6404 7.4481 7.9670 6.3503 4.4915 6.3950 1.6818 6.2551 4.6704 3.7884 6.5169 5.9692 2.4103 3.2619 1.6995 1.4067 1.3710 1.5444 7.5737 5.2513 1.4800 1.4757 1.3622 1.3915 4.8636 1.3892 1.3882 1.3654 2.6590 2.1666 2.2374 1.5862 1.8374 2.2359 1.6320 2.2586 2.4063 1.0571 1.2990 1.1907 10.0792 7.8995 2.9359 1.8609 3.4364 1.3290 1.3563 6.2852 6.9831 11.1831 8.6431 9.5194 3.8126 6.4592 2.2670 2.8441 2.2267 2.5522 10.2156 7.1402 7.5727 7.1473 6.9529 6.1372 6.9947 1.0852 1.0881 1.0886 1.0924 1.0896 1.0959 1.0950 1.0911 1.1013 1.0970 1.0926 1.0965
irintensity: 0.1948 1.4509 1.0661 0.3934 1.3173 0.3187 1.9335 0.7430 3.5595 1.3988 2.0791 1.8652 3.4213 0.7806 8.7001 1.4693 1.1548 2.4340 0.7229 0.5570 0.4930 5.0125 2.8420 2.6346 0.5962 1.8536 4.3422 7.3602 17.1746 2.1560 0.7611 9.7773 2.2527 13.1709 17.6008 3.0367 13.2380 11.2201 10.5638 12.3797 83.1186 15.8554 10.6901 34.5762 19.6639 11.9055 13.8659 11.8138 13.9843 36.4950 7.6077 25.8060 45.5878 116.6034 6.4197 25.9025 0.2206 6.4198 5.7636 3.3598 0.0903 4.3223 18.4277 3.5225 46.9408 10.5243 8.6013 12.9443 0.6231 138.1356 117.2449 0.2907 11.9246 42.7828 314.1929 494.7949 480.9055 30.4837 361.4666 36.5330 17.2951 64.1944 45.3168 64.7200 1.9424 50.2365 9.0779 19.4135 20.1957 251.9448 7.6226 16.2259 145.0141 16.5721 21.1413 89.5945 293.1689 9.2497 21.8262 0.8111 4.9795 3.7264 23.2035 3.2661 15.6779 4.9368 1.1666 22.5883 1.0933 18.1552 6.2645
temp: 298.150 k
press: 1.00000 atm
elementType: 8 8 8 8 8 8 7 7 6 6 6 6 6 6 6 6 6 6 6 6 6 6 6 6 6 6 6 1 1 1 1 1 1 1 1 1 1 1 1
symmnumber: 1
zpe: 715069.8 jmol-1
zpe.correction: 0.272356 hartree
zpe.thermalcorrener: 0.294729 hartree
zpe.thermalcorrenthalpy: 0.295673 hartree
zpe.thermalcorrgfe: 0.216532 hartree
zpe.sumelectzpe: -1290.016135 hartree
zpe.sumelectthermal: -1289.993762 hartree
zpe.sumelectthermalent: -1289.992817 hartree
zpe.sumelectthermalfe: -1290.071959 hartree
dipole: -7.0322 -2.3147 -2.8812
dipole: 7.9443
quadrupole: -177.6666 -175.4584 -152.7524
quadrupole: 2.0468 16.4690 2.9379
quadrupole: -9.0408 -6.8326 15.8734 2.0468 16.4690 2.9379
hfenergy: -1290.2884906 hartree
pointgroup: C01 [X(C19H12N2O6)]
dipole: -2.7275668 -1.3460449 -0.7192836 debye
polarizability: 443.8326044|4.3740797|202.6660155|15.7806985|-7.7752449|180.5651455 unknown
InChI: InChI=1S/C19H12N2O6/c22-19(13-4-2-1-3-5-13)14-6-9-16(10-7-14)27-18-11-8-15(20(23)24)12-17(18)21(25)26/h1-12H
charge 0 multiplicity 1
39 atoms
O  1.386631 1.107667 -0.761297
O  -4.215688 0.651574 2.325311
O  4.997336 2.96771 -0.821795
O  3.118982 2.695725 -2.092683
O  5.936442 -2.987092 1.087848
O  7.21362 -1.230647 0.378714
N  3.967513 2.292225 -1.215034
N  6.077176 -1.80267 0.591589
C  -2.555032 0.377719 0.61571
C  0.086455 0.787221 -0.260588
C  2.502801 0.36488 -0.411149
C  3.792745 0.940187 -0.626781
C  -2.274028 0.545267 -0.766925
C  -1.487942 0.454045 1.551583
C  -3.954689 0.230255 1.154557
C  -0.95215 0.758304 -1.210477
C  -0.162617 0.651505 1.124423
C  -5.032408 -0.402556 0.322866
C  2.424665 -0.947405 0.129141
C  4.963782 0.243219 -0.281779
C  4.847802 -1.054649 0.24447
C  3.587372 -1.662281 0.447088
C  -4.76417 -1.401198 -0.653155
C  -6.380376 -0.036843 0.588702
C  -5.825367 -2.012599 -1.355555
C  -7.436322 -0.635156 -0.12563
C  -7.16139 -1.624841 -1.101074
H  -3.089823 0.544319 -1.495916
H  -1.725233 0.376235 2.617286
H  -0.717772 0.916716 -2.266636
H  0.654187 0.725733 1.84927
H  1.443367 -1.403501 0.283479
H  5.944191 0.705954 -0.421573
H  3.540963 -2.678271 0.847305
H  -3.734825 -1.727156 -0.835992
H  -6.572935 0.713331 1.362723
H  -5.612345 -2.792888 -2.094196
H  -8.470943 -0.338267 0.076742
H  -7.983179 -2.095469 -1.652074
