program: Gaussian 09
title: 000243165
version: EM64L-G09RevD.01
frameworkgroup: C1[X(C6H7N3O2)]
method: RPBEPBE
basis: SDD
operation: Freq
keyword: #pfreq=noraman
keyword: PBEPBE/SDD
title: #p freq=noraman PBEPBE/SDD
converged: NO YES NO NO
title: Mulliken charges:
elementType: O O N N N C C C C C C H H H H H H H
charge: -0.226609 -0.221086 -0.042760 0.025433 -0.618870 0.437360 0.194498 -0.461139 -0.757563 0.174653 -0.418328 0.233712 0.258704 0.206386 0.258809 0.292707 0.340531 0.323562
chargesum: 0.00000
title: Mulliken charges with hydrogens summed into heavy atoms:
elementType: O O N N N C C C C C C
charge: -0.226609 -0.221086 -0.042760 0.025433 0.045223 0.437360 0.194498 -0.227427 -0.033664 0.174653 -0.125621
polarizability: 1.62724884e+02 -1.11407843e-01 1.05099357e+02 2.46154374e-03 -7.19472488e-03 4.23049709e+01
1716.lowfreq: -10.4828 -5.6572 -0.0009 -0.0006 -0.0005 8.0093 16.8813 90.6721 186.7809
frequency: 16.5876 90.6645 186.7797 219.7184 232.2289 278.1882 315.3579 352.4899 398.5870 441.0816 446.7304 509.5636 540.0165 562.0723 588.2515 619.5239 688.5652 751.5865 756.5103 768.1486 859.1476 921.9362 958.5904 999.8599 1041.8364 1047.3138 1079.8014 1187.1090 1212.0655 1264.9052 1313.7310 1355.2733 1359.8695 1403.5389 1435.9197 1450.5414 1461.5148 1480.8824 1535.4357 1599.1664 1626.2667 3000.0955 3090.1898 3101.2012 3141.6580 3171.6489 3544.2197 3700.0083
redmass: 8.5552 5.2269 2.5037 1.1541 6.7165 6.4811 2.8686 8.7472 4.4210 1.3800 2.0088 4.8142 1.2132 5.0950 3.4747 7.8368 7.3867 5.6415 4.0432 10.0039 1.5279 3.8167 1.4201 1.4959 1.5730 1.5120 7.5868 2.4466 6.7240 1.9794 2.0063 5.9763 4.6529 1.2497 2.7111 1.0456 1.5746 2.4728 6.4729 2.4397 1.8621 1.0364 1.0960 1.1015 1.0923 1.0922 1.0454 1.1043
irintensity: 0.2469 0.4393 2.6405 0.1606 0.7134 6.3553 5.4381 0.9239 1.2854 83.7194 96.1360 4.7319 101.7007 1.1697 42.2243 10.2914 0.6913 0.7952 5.6828 9.4815 27.1848 4.9000 9.9650 0.2026 12.0019 6.5120 3.1109 43.0974 499.2770 28.7763 55.0367 85.6730 2.6256 29.7163 11.1034 13.2281 19.0937 82.0685 76.4250 83.9350 565.1748 12.5507 5.3471 22.8386 13.1424 0.3918 162.0010 43.1531
temp: 298.150 k
press: 1.00000 atm
elementType: 8 8 7 7 7 6 6 6 6 6 6 1 1 1 1 1 1 1
symmnumber: 1
zpe: 347553.3 jmol-1
zpe.correction: 0.132376 hartree
zpe.thermalcorrener: 0.142249 hartree
zpe.thermalcorrenthalpy: 0.143193 hartree
zpe.thermalcorrgfe: 0.096081 hartree
zpe.sumelectzpe: -546.663053 hartree
zpe.sumelectthermal: -546.653180 hartree
zpe.sumelectthermalent: -546.652236 hartree
zpe.sumelectthermalfe: -546.699349 hartree
dipole: 6.8123 3.3379 0.0023
dipole: 7.5861
quadrupole: -60.5483 -62.6774 -64.8616
quadrupole: 0.9806 -0.0044 0.0052
quadrupole: 2.1475 0.0184 -2.1659 0.9806 -0.0044 0.0052
hfenergy: -546.7954291 hartree
pointgroup: C01 [X(C6H7N3O2)]
dipole: -2.6692134 1.3339383 -0.0621344 debye
dipolederiv: -0.705857 0.2276986 -0.0103387 0.4452968 -0.7954911 0.0109507 -0.0117299 0.007218 -0.247329 -0.8753083 -0.1906349 -0.0124644 -0.3420535 -0.6540876 -0.005325 -0.0124506 -0.0028132 -0.2358234 -1.012424 -0.0389537 -0.0148845 0.5374106 -0.3704159 0.0114622 -0.0177504 -0.000232 -0.2783914 2.085906 -0.1250603 0.0395425 -0.1988796 1.1660662 -0.0073459 0.0404051 -0.0060302 0.2011488 -1.7922307 -0.0493017 -0.022243 -0.0005433 -0.1362353 -0.0027445 -0.0223976 -0.0037443 -0.6937762 0.7068862 0.0746913 0.0130162 -0.2184648 0.4733461 -0.0066272 0.0143247 -0.0004199 0.0545704 -1.1624298 0.0219302 -0.0242806 0.0673632 -0.4084055 0.0032999 -0.0241881 0.0023158 0.0090261 -0.7851106 -0.1212596 -0.0112972 -0.5679935 -0.1310361 -0.012042 -0.0091371 -0.002955 -0.202241 -0.0362802 -0.2685157 0.0004467 -0.1432622 -0.0792076 -0.0025938 -0.0002365 -0.0052382 0.0057472 2.0018743 -0.0001302 0.0365562 0.0000078 0.3240481 -0.0005329 0.0365497 -0.0005823 0.217502 0.7987976 0.1668415 0.0154956 0.2211002 0.2230955 0.0034317 0.0157545 0.0022269 -0.0001744 0.0264292 0.059814 -0.0031397 0.0811924 -0.0694784 0.0028629 -0.0032607 0.0024521 0.1638396 0.056871 -0.0110069 0.0867694 0.0066717 0.0758936 -0.0165895 0.0715203 0.009114 0.0020371 -0.0145854 0.1939344 -0.0034331 0.0553218 -0.0724978 0.0020573 -0.0027211 0.0049621 0.1050462 0.0634089 -0.0115457 -0.084068 0.0052787 0.0760745 0.0160736 -0.0689114 -0.0102881 -0.0043504 0.0896546 0.0509029 -0.0010911 0.0343404 0.0575041 0.0010836 -0.0011273 0.0013643 0.1305511 0.2757066 0.0319368 -0.0023418 0.1094667 0.1879303 0.003195 -0.0028017 0.0015978 0.3821591 0.2786914 -0.0113412 -0.0022445 -0.0922536 0.1328969 -0.0006159 -0.0018418 0.0010522 0.3904582 unknown
polarizability: 162.6721375|-0.328908|105.0997261|2.4779892|-0.2994867|42.3573487 unknown
InChI: InChI=1S/C6H7N3O2/c1-4-2-6(7)8-3-5(4)9(10)11/h2-3H,7H2,1H3
charge 0 multiplicity 1
18 atoms
O  2.495036 -1.676168 0.04468
O  2.857016 0.572661 0.043922
N  -1.561527 -1.350754 -0.039101
N  2.063271 -0.45343 0.030262
N  -3.526444 -0.105425 -0.085516
C  0.017339 1.073016 -0.018798
C  0.6129 -0.233061 -0.000282
C  -1.39009 1.103677 -0.04784
C  0.778374 2.381646 -0.009689
C  -2.151189 -0.1041 -0.057343
C  -0.212216 -1.389666 -0.011415
H  -1.9037 2.070608 -0.063408
H  1.459839 2.455879 -0.873843
H  0.074415 3.230933 -0.028544
H  1.423401 2.464705 0.881209
H  0.257538 -2.377078 0.002954
H  -4.00061 -1.007191 -0.090854
H  -4.067553 0.754249 -0.100892
