program: Gaussian 09
title: 000243196
version: EM64L-G09RevD.01
frameworkgroup: C1[X(C22H15NO3S)]
method: RPBEPBE
basis: SDD
operation: Freq
keyword: #p
keyword: freq=noraman
keyword: PBEPBE/SDD
title: #p freq=noraman PBEPBE/SDD
converged: NO YES NO NO
title: Mulliken charges:
elementType: S O O O N C C C C C C C C C C C C C C C C C C C C C C H H H H H H H H H H H H H H H
charge: 0.814513 -0.514537 -0.542038 -0.215691 -0.367129 -0.388786 0.327032 -0.243968 0.475266 0.378884 0.295318 -0.304784 0.424332 0.430502 -0.333359 -0.465573 -0.469375 0.193000 -0.405929 -0.381994 -0.425885 -0.431016 -0.244656 -0.251166 -0.779913 -0.237520 -0.235241 0.293059 0.277101 0.256238 0.246711 0.311155 0.268696 0.247748 0.248480 0.236409 0.238607 0.264341 0.277424 0.262113 0.233911 0.237717
chargesum: 0.00000
title: Mulliken charges with hydrogens summed into heavy atoms:
elementType: S O O O N C C C C C C C C C C C C C C C C C C C C C C
charge: 0.814513 -0.514537 -0.542038 -0.215691 -0.367129 -0.388786 0.327032 -0.243968 0.475266 0.378884 0.295318 -0.011724 0.424332 0.430502 -0.056258 -0.209335 -0.222664 0.193000 -0.094774 -0.113297 -0.178137 -0.182536 -0.008246 -0.012559 0.023965 -0.003609 0.002476
polarizability: 4.08875500e+02 1.93884906e+01 2.86678775e+02 3.25502841e+00 6.41990463e+00 1.81166180e+02
1716.lowfreq: -8.2527 -5.2165 -0.0017 -0.0012 -0.0010 5.9575 31.5321 49.0128 59.8996
frequency: 31.5255 49.0075 59.8930 72.3168 79.4425 93.0805 114.9467 123.4974 142.0415 165.6256 176.8330 180.3046 197.5626 217.1700 225.1894 251.6663 270.6400 294.7248 315.5176 347.5150 361.3741 387.9575 398.4571 415.1105 422.9176 434.3694 462.2736 498.1328 509.6989 510.0779 520.0825 522.3036 530.3974 543.2496 571.3006 588.1652 598.3280 621.8605 641.0510 662.3903 665.3566 683.3299 762.8777 766.0992 770.4821 781.8596 787.2260 795.6819 798.5537 816.4023 829.8378 840.9757 846.9716 891.9998 895.6612 909.8459 916.5546 936.2136 961.3835 965.3753 970.3437 983.0487 987.5432 1001.7238 1005.6095 1023.6250 1027.1601 1038.3832 1044.1706 1079.6907 1127.2142 1136.9794 1149.3306 1158.9996 1178.0761 1179.7104 1194.6575 1231.2202 1235.9971 1237.5821 1256.7458 1273.4367 1282.9991 1335.1851 1353.8781 1384.9228 1398.4740 1400.3956 1406.5885 1415.3293 1425.4013 1434.1486 1440.7016 1451.1572 1456.3737 1464.9319 1506.3473 1512.4810 1563.7051 1578.9505 1585.7465 1599.1638 1624.7533 1629.0012 1633.6527 2998.5170 3091.4092 3127.8068 3130.6954 3133.8585 3139.3015 3140.3663 3141.2537 3142.4668 3154.1965 3154.8736 3165.5348 3167.7154 3169.8480 3195.9707
redmass: 6.4911 4.5515 6.9227 6.0365 3.0793 4.4797 4.2219 1.6631 3.4534 4.5472 4.8452 6.6353 7.6322 6.9102 5.1657 8.6614 5.9525 5.5207 6.7625 5.5099 5.6890 7.3388 4.7470 6.5962 3.5286 4.1918 5.3929 4.9014 4.3596 5.1631 4.7823 6.2188 4.7213 3.6454 3.5631 4.2422 5.7457 5.7872 6.4161 6.0188 4.5078 4.0052 2.1337 1.3326 1.9438 8.5682 3.6685 4.5128 4.7486 4.8055 1.7732 1.6071 2.8043 1.5911 1.6599 5.7646 12.4820 5.9309 1.8436 1.6588 1.5001 1.4190 1.3937 1.3507 1.3402 2.5063 2.4310 2.2981 1.6832 3.2917 1.8853 2.1614 1.2822 1.2701 1.1478 1.1347 1.9416 1.9616 2.2232 2.7391 2.9842 1.7949 2.0752 2.1834 3.8170 1.2239 4.9722 3.2543 4.0203 6.5313 2.7917 2.5336 2.6315 1.0809 2.3558 1.0513 3.4893 4.0612 7.9429 6.4655 7.5035 6.3452 7.7216 6.8999 7.3371 1.0378 1.0970 1.0869 1.0866 1.1000 1.0906 1.0886 1.0897 1.0881 1.0955 1.0948 1.0970 1.1008 1.1005 1.0952
irintensity: 2.0876 2.4558 1.3689 0.9161 1.9399 1.3941 0.5689 0.5268 1.2117 0.2973 0.7739 0.7860 10.6028 2.0602 10.4220 3.4632 0.6886 0.0280 2.5350 10.3999 2.1922 27.9135 3.8647 41.8278 12.8128 21.5368 30.9964 6.3759 3.8424 4.7422 1.9655 10.7544 7.1938 1.6994 1.1857 5.2707 6.9414 18.1608 7.9680 13.2925 8.8183 2.9729 10.5858 61.5967 7.3108 42.9390 20.8680 20.0987 6.3561 30.4258 21.0984 79.1042 19.0710 5.9106 7.5618 0.9388 78.9848 2.8180 5.9051 7.7259 5.7710 9.7751 3.6772 0.1999 0.9481 20.2681 13.7077 6.3323 7.1234 14.4351 4.1887 7.0507 1.0368 2.6584 11.7126 4.6139 23.4340 24.5354 102.5359 142.6387 137.2224 23.6092 13.8772 12.1999 61.7858 58.3285 18.6639 6.7656 8.5923 1.2157 2.9862 11.8907 10.7211 28.3960 1.7597 16.0725 35.5066 11.5054 10.5840 3.0468 48.6581 13.5727 121.6260 33.1916 49.9066 2.0898 2.9929 0.5961 1.1457 6.9158 3.1466 1.7658 25.2896 7.9713 1.8842 18.0552 9.1251 46.3523 25.4448 0.8841
temp: 298.150 k
press: 1.00000 atm
elementType: 16 8 8 8 7 6 6 6 6 6 6 6 6 6 6 6 6 6 6 6 6 6 6 6 6 6 6 1 1 1 1 1 1 1 1 1 1 1 1 1 1 1
symmnumber: 1
zpe: 811606.6 jmol-1
zpe.correction: 0.309125 hartree
zpe.thermalcorrener: 0.331051 hartree
zpe.thermalcorrenthalpy: 0.331995 hartree
zpe.thermalcorrgfe: 0.258770 hartree
zpe.sumelectzpe: -1523.845564 hartree
zpe.sumelectthermal: -1523.823637 hartree
zpe.sumelectthermalent: -1523.822693 hartree
zpe.sumelectthermalfe: -1523.895919 hartree
dipole: -3.7088 -1.4149 -5.5522
dipole: 6.8253
quadrupole: -124.0439 -163.9426 -174.8691
quadrupole: -6.5338 -4.8573 2.2895
quadrupole: 30.2413 -9.6574 -20.5839 -6.5338 -4.8573 2.2895
hfenergy: -1524.1546882 hartree
pointgroup: C01 [X(C22H15N1O3S1)]
dipole: 1.4388025 0.3992418 -2.2318328 debye
polarizability: 407.581956|22.6410248|285.8948535|-5.4360133|-16.1096739|183.2436465 unknown
InChI: InChI=1S/C22H15NO3S/c1-14(24)23-19-12-10-16-7-3-5-9-18(16)22(19)27(25,26)20-13-11-15-6-2-4-8-17(15)21(20)23/h2-13H,1H3
charge 0 multiplicity 1
42 atoms
S  -0.745992 -1.477864 1.371447
O  -0.627484 -0.948915 2.913896
O  -1.333847 -2.979233 1.082982
O  0.269872 3.095589 1.719609
N  0.578593 1.042708 0.635468
C  -1.583393 -0.121348 0.322195
C  1.420076 -0.085328 0.327242
C  0.943942 -1.375324 0.55766
C  -0.786233 1.018934 0.147814
C  -2.925345 -0.231123 -0.161154
C  2.696289 0.064074 -0.330004
C  1.642288 -2.562224 0.234808
C  -3.464386 0.936312 -0.841521
C  3.456519 -1.137146 -0.627655
C  -1.335982 2.149654 -0.530628
C  2.908733 -2.431964 -0.335704
C  -2.646507 2.101631 -0.999835
C  0.948352 2.044652 1.601039
C  -3.757291 -1.390484 0.002817
C  3.225365 1.337907 -0.720114
C  -4.810509 0.896141 -1.330413
C  4.739843 -1.003677 -1.254305
C  -5.065875 -1.386158 -0.484852
C  4.473083 1.429368 -1.340439
C  2.119974 1.703698 2.50609
C  -5.599972 -0.240809 -1.155199
C  5.24416 0.25172 -1.59723
H  1.17766 -3.532355 0.436319
H  -0.717239 3.039833 -0.655391
H  3.497044 -3.322287 -0.583431
H  -3.069226 2.972451 -1.513557
H  -3.351533 -2.277349 0.49856
H  2.632321 2.241162 -0.54433
H  -5.210522 1.779187 -1.842134
H  5.316927 -1.910396 -1.46968
H  -5.692262 -2.275101 -0.355003
H  4.863686 2.407684 -1.639621
H  2.224446 2.516341 3.239572
H  1.911989 0.755745 3.035402
H  3.069323 1.589656 1.957191
H  -6.629213 -0.261589 -1.528935
H  6.224523 0.340026 -2.07708
