program: Gaussian 09
title: 000243166
version: EM64L-G09RevD.01
frameworkgroup: C1[X(C6H7N3O2)]
method: RPBEPBE
basis: SDD
operation: Freq
keyword: #pfreq=noraman
keyword: PBEPBE/SDD
title: #p freq=noraman PBEPBE/SDD
converged: YES YES NO NO
title: Mulliken charges:
elementType: O O N N N C C C C C C H H H H H H H
charge: -0.208568 -0.272637 -0.057371 0.028117 -0.608294 0.414727 0.092259 0.098662 -0.338132 -0.754813 -0.316877 0.241559 0.258119 0.210458 0.256844 0.245381 0.334448 0.376118
chargesum: 0.00000
title: Mulliken charges with hydrogens summed into heavy atoms:
elementType: O O N N N C C C C C C
charge: -0.208568 -0.272637 -0.057371 0.028117 0.102272 0.414727 0.092259 0.098662 -0.096573 -0.029392 -0.071496
polarizability: 1.28473358e+02 1.55429666e+00 1.26242049e+02 5.33462134e-02 -1.35435531e-01 4.20111944e+01
1716.lowfreq: -8.7857 -0.0010 -0.0005 0.0006 8.6231 11.9426 25.4070 103.2320 195.3089
frequency: 25.3314 103.2284 195.3085 252.0606 254.3435 298.7655 361.3673 380.7363 386.1326 478.1531 520.4399 536.3328 565.1206 580.2771 620.3005 682.4143 731.5639 741.4026 776.5728 821.2809 823.9300 959.8000 964.0790 983.0881 1039.8489 1062.0856 1095.2072 1131.5505 1179.4938 1251.4846 1325.3717 1336.3729 1351.2259 1403.6235 1419.3293 1453.0524 1463.5517 1477.4326 1536.3556 1559.6391 1586.8873 2999.1671 3086.7185 3100.8095 3134.6647 3170.6582 3423.4299 3633.8582
redmass: 6.8979 5.4919 3.9020 1.6212 1.8921 7.3706 3.6370 4.9270 5.4447 3.9429 7.5155 3.6478 2.0735 6.0562 1.5983 7.4388 1.0905 9.1773 7.0497 6.6622 1.2074 2.9018 1.4287 1.9589 1.5706 3.1519 2.6512 2.0813 4.4370 2.4822 4.8123 4.3691 1.9823 1.1941 2.6640 1.0463 1.1777 2.3992 2.0557 5.2565 4.2631 1.0364 1.0958 1.1017 1.0899 1.0961 1.0503 1.0999
irintensity: 1.1048 2.5767 0.3400 5.1356 0.4502 6.0438 3.6502 7.2425 1.8596 7.9244 0.0455 3.9469 40.9879 0.8357 138.6696 8.5868 92.1741 9.4007 34.9990 4.9060 21.7260 1.2786 0.5991 7.2915 11.8480 8.1148 6.5899 71.4498 194.7638 70.7181 15.4351 131.1021 64.7724 23.0716 22.9844 13.3355 39.8835 8.9073 16.4390 118.5636 485.2963 10.3551 5.4008 26.8779 15.3640 14.2015 75.1931 93.7775
temp: 298.150 k
press: 1.00000 atm
elementType: 8 8 7 7 7 6 6 6 6 6 6 1 1 1 1 1 1 1
symmnumber: 1
zpe: 348495.2 jmol-1
zpe.correction: 0.132735 hartree
zpe.thermalcorrener: 0.142170 hartree
zpe.thermalcorrenthalpy: 0.143115 hartree
zpe.thermalcorrgfe: 0.097361 hartree
zpe.sumelectzpe: -546.665755 hartree
zpe.sumelectthermal: -546.656320 hartree
zpe.sumelectthermalent: -546.655376 hartree
zpe.sumelectthermalfe: -546.701129 hartree
dipole: -3.3053 0.6299 0.0223
dipole: 3.3648
quadrupole: -72.8847 -53.3574 -64.8848
quadrupole: -4.0835 0.0520 0.0627
quadrupole: -9.1758 10.3516 -1.1758 -4.0835 0.0520 0.0627
hfenergy: -546.7984903 hartree
pointgroup: C01[X(C6H7N3O2)]
dipole: 1.3066077 0.2078631 0.0457067 debye
dipolederiv: -0.7425003 0.2749854 -0.0228786 0.3408435 -0.7598159 0.0154977 -0.0215495 0.0103112 -0.2153475 -0.664512 -0.20535 -0.0158926 -0.3913445 -0.6970471 -0.0189861 -0.0114995 -0.0101416 -0.2841438 -0.4201125 -0.6652768 0.0044038 0.0309755 -0.7002763 0.0087786 -0.0074131 -0.0263266 -0.2808251 1.7559056 -0.1708887 0.068594 0.0383477 1.0883328 0.0074104 0.0631377 -0.003137 0.1905864 -0.3057278 -0.4268278 0.0245921 -0.1842084 -1.2354256 -0.0001154 0.0185544 -0.0081421 -0.6232767 0.6924381 -0.2879065 0.0348705 0.3293212 0.4050122 0.006935 0.0279404 -0.0201713 0.0573252 -0.935179 0.3162641 -0.0463843 -0.2997237 -0.4269108 -0.0088758 -0.0365128 0.0196453 -0.012085 0.4111006 0.6170882 -0.0001891 0.1711439 1.1987823 -0.0063882 0.0022375 0.0157678 0.217335 -0.7219923 0.4242175 -0.0324297 0.3609403 -0.3285714 0.0186816 -0.0314304 0.0225968 -0.1861391 -0.0029728 0.2960768 -0.0071832 0.1351608 -0.1181889 0.0066166 -0.0030762 0.0123077 0.0045626 0.4756421 0.0995798 0.0216977 -0.4048889 0.7976952 -0.0326153 0.0324881 -0.0099218 -0.0078243 0.0470864 -0.0528234 -0.0046683 -0.0931885 -0.053685 0.0001208 -0.0047082 0.0029258 0.1677424 0.0573927 0.0085639 0.0885323 0.000287 0.07454 0.0066095 0.0704104 -0.0134841 0.0057668 -0.038009 -0.2004306 -0.0005468 -0.0650484 -0.0474704 0.0017506 -0.0043446 -0.0030093 0.1051009 0.0681372 0.0015725 -0.0847194 -0.0027906 0.0736545 -0.0105855 -0.0671305 0.0108241 -0.0075243 -0.1111376 -0.0218552 -0.0108793 -0.012 0.0927039 0.0001359 -0.0112996 -0.0004942 0.1226142 0.1890478 0.0079584 -0.0093041 -0.0032925 0.3131399 0.0008273 -0.0079049 0.000633 0.3675064 0.2453926 -0.0149475 -0.0076149 0.0494658 0.3235309 0.0042023 -0.0078994 -0.0001836 0.3786259 unknown
polarizability: 128.2006378|-1.5635398|126.3219224|3.8936531|-1.2747556|42.2040408 unknown
InChI: InChI=1S/C6H7N3O2/c1-4-2-3-8-6(7)5(4)9(10)11/h2-3H,7H2,1H3
charge 0 multiplicity 1
18 atoms
O  -2.493425 1.082545 -0.104313
O  -2.405749 -1.182267 -0.102432
N  1.793094 -1.198515 0.103624
N  -1.806901 -0.013397 -0.077683
N  -0.147116 -2.447453 0.029909
C  0.345425 1.293203 -0.009583
C  -0.350326 0.034673 -0.017549
C  0.413728 -1.203553 0.03732
C  1.755292 1.240694 0.056749
C  -0.311774 2.657017 -0.068046
C  2.42345 -0.005326 0.112432
H  2.333288 2.168452 0.065218
H  -0.996558 2.816803 0.781906
H  0.463876 3.441191 -0.06016
H  -0.933895 2.773022 -0.971713
H  3.517428 -0.047999 0.166061
H  0.492198 -3.240397 0.075255
H  -1.168033 -2.526592 -0.022692
