program: Gaussian 09
title: 000243172
version: EM64L-G09RevD.01
frameworkgroup: C1[X(C10H12N2O3)]
method: RPBEPBE
basis: SDD
operation: Freq
keyword: #p
keyword: freq=noraman
keyword: PBEPBE/SDD
title: #p freq=noraman PBEPBE/SDD
converged: YES YES NO NO
title: Mulliken charges:
elementType: O O O N N C C C C C C C C C C H H H H H H H H H H H H
charge: -0.171384 -0.175922 -0.337271 -0.315673 0.050573 0.296394 0.354290 -0.335340 -0.315696 -0.789386 0.196629 0.196657 -0.228640 -0.770511 -0.772909 0.314274 0.244876 0.247177 0.249200 0.233503 0.285028 0.254641 0.246491 0.269518 0.260618 0.269932 0.242929
chargesum: 0.00000
title: Mulliken charges with hydrogens summed into heavy atoms:
elementType: O O O N N C C C C C C C C C C
charge: -0.171384 -0.175922 -0.337271 -0.315673 0.050573 0.296394 0.354290 -0.021065 -0.070820 -0.059506 0.196629 0.196657 0.056388 0.000140 0.000570
polarizability: 1.74759098e+02 5.80649799e+00 1.18705306e+02 -7.63684375e+00 -1.49578288e+01 1.14543777e+02
1716.lowfreq: -9.7225 -7.5005 -0.0001 0.0005 0.0009 6.4724 29.2886 44.7364 59.7427
frequency: 27.8804 44.5991 59.3487 64.3607 83.3782 96.5530 110.2608 133.1223 152.3071 179.2018 267.3126 283.6511 330.5793 334.3074 355.1743 393.9018 413.6888 464.1509 471.0359 507.0083 521.8510 535.6909 610.9443 621.0456 628.3323 690.3634 710.0655 761.6968 817.8872 850.7935 858.8013 881.6643 936.4896 962.0626 988.4781 1013.2526 1018.8490 1033.1155 1033.8514 1039.4585 1126.1661 1184.6596 1198.7817 1201.8863 1209.5886 1268.2669 1280.7727 1293.9150 1378.5091 1381.6063 1409.7151 1431.0181 1444.6288 1447.6609 1456.7215 1459.7729 1461.5907 1465.1424 1475.7599 1515.8748 1613.8577 1620.4668 1676.2409 2976.9749 2998.5197 2999.1735 3051.8215 3084.0387 3086.5644 3095.5980 3131.2618 3133.2964 3156.2450 3200.7293 3214.8937
redmass: 2.7880 2.0873 1.8594 3.1007 2.4442 1.9505 2.7776 3.4510 1.0436 5.1500 4.6175 4.1850 5.4094 4.3716 3.4121 5.3726 4.9641 6.3662 3.4622 3.5173 4.0497 2.8441 3.4016 4.2448 4.1488 6.6153 3.6114 4.4532 1.3680 5.6479 1.6266 3.8411 1.3129 1.8341 1.6698 1.7981 2.3869 1.8330 1.7446 1.5559 1.5943 3.9237 4.5298 5.0899 2.1384 1.9557 2.4424 6.8793 1.2184 1.2117 1.2102 2.7735 1.0691 1.0851 1.1235 1.0671 1.2709 1.0710 2.7717 3.3922 8.4278 7.2718 9.7197 1.0401 1.0372 1.0372 1.0942 1.0971 1.0971 1.0992 1.1002 1.1001 1.0913 1.0939 1.0963
irintensity: 1.6009 6.0600 2.4668 2.3534 0.6923 0.2545 0.4030 2.3742 0.2680 0.7356 0.1474 0.6284 7.5701 4.0301 2.2478 4.4770 2.8365 4.4961 2.6145 28.7297 2.7386 0.7713 8.8638 2.4193 8.8580 0.4561 16.1739 16.6643 36.1609 1.1771 9.3364 0.4667 1.6470 5.4513 14.7013 69.8340 2.5680 12.3527 7.1429 2.7081 43.9940 21.7827 137.8673 630.1028 26.7680 0.0070 6.6322 46.5022 41.7763 42.4001 12.2230 17.2356 14.3377 21.6013 16.8327 19.1586 39.2786 18.8041 85.3348 53.4100 61.0026 35.1058 332.5026 18.1755 3.2071 4.5948 13.2980 9.5170 7.0233 16.8879 10.0171 9.6543 6.4726 2.4617 0.3630
temp: 298.150 k
press: 1.00000 atm
elementType: 8 8 8 7 7 6 6 6 6 6 6 6 6 6 6 1 1 1 1 1 1 1 1 1 1 1 1
symmnumber: 1
zpe: 540821.1 jmol-1
zpe.correction: 0.205988 hartree
zpe.thermalcorrener: 0.221583 hartree
zpe.thermalcorrenthalpy: 0.222528 hartree
zpe.thermalcorrgfe: 0.161614 hartree
zpe.sumelectzpe: -722.281643 hartree
zpe.sumelectthermal: -722.266048 hartree
zpe.sumelectthermalent: -722.265104 hartree
zpe.sumelectthermalfe: -722.326017 hartree
dipole: 3.6954 -3.0861 3.5766
dipole: 5.9977
quadrupole: -118.8491 -84.9935 -83.3472
quadrupole: -5.1769 7.1077 2.2288
quadrupole: -23.1192 10.7365 12.3827 -5.1769 7.1077 2.2288
hfenergy: -722.4876313 hartree
pointgroup: C01 [X(C10H12N2O3)]
dipole: -1.4825264 -0.0858314 1.833791 debye
polarizability: 174.437369|0.7841641|101.9179506|10.178619|3.6699531|131.652862 unknown
InChI: InChI=1S/C10H12N2O3/c1-7-4-5-11(15)6-10(7)12(8(2)13)9(3)14/h4-6H,1-3H3
charge 0 multiplicity 1
27 atoms
O  3.118477 1.265468 0.189515
O  2.973577 -1.205805 -1.073213
O  -3.327308 0.046991 -1.926877
N  1.151714 -0.000053 -0.167579
N  -2.521874 0.00294 -0.86785
C  -0.275385 -0.02163 0.081804
C  -0.780307 -0.09855 1.413307
C  -1.137827 0.030468 -1.023905
C  -2.193897 -0.117424 1.537642
C  0.134318 -0.152601 2.616455
C  1.878417 1.241368 0.038074
C  1.813576 -1.214699 -0.608381
C  -3.040768 -0.069018 0.426047
C  1.023525 2.504391 0.044263
C  0.990096 -2.493245 -0.486127
H  -0.792863 0.095119 -2.05695
H  -2.654772 -0.177712 2.52856
H  0.950559 -0.884876 2.479243
H  0.623649 0.82316 2.804174
H  -0.425509 -0.42343 3.527044
H  -4.130059 -0.085423 0.473741
H  0.450201 2.601869 -0.894669
H  0.294596 2.511004 0.874118
H  1.698146 3.365965 0.153236
H  0.2095 -2.541405 -1.266743
H  1.673956 -3.343296 -0.626576
H  0.484757 -2.576075 0.491446
