program: Gaussian 09
title: 000243157
version: EM64L-G09RevD.01
frameworkgroup: C1[X(C8H14N4O)]
method: RPBEPBE
basis: SDD
operation: Freq
keyword: #p
keyword: freq=noraman
keyword: PBEPBE/SDD
title: #p freq=noraman PBEPBE/SDD
converged: YES YES NO NO
title: Mulliken charges:
elementType: O N N N N C C C C C C C C H H H H H H H H H H H H H H
charge: -0.257302 -0.387805 -0.453802 -0.042486 -0.631473 -0.326862 -0.434011 -0.335413 0.472084 -0.686473 -0.483579 0.154459 0.038952 0.203940 0.210783 0.234151 0.185227 0.187373 0.197028 0.310083 0.215543 0.220726 0.213039 0.305801 0.236186 0.301902 0.351928
chargesum: 0.00000
title: Mulliken charges with hydrogens summed into heavy atoms:
elementType: O N N N N C C C C C C C C
charge: -0.257302 -0.077722 -0.148001 -0.042486 0.022357 0.087861 -0.014633 0.048988 0.472084 -0.037164 -0.247392 0.154459 0.038952
polarizability: 1.58906639e+02 6.74281834e+00 1.24564942e+02 -2.22276103e+01 -6.86654238e+00 8.35467739e+01
1716.lowfreq: -3.9302 -0.0005 -0.0005 0.0006 3.8536 16.0399 21.4222 35.6394 69.6856
frequency: 21.3809 35.5745 69.6182 110.9625 118.6670 151.6891 187.8341 191.3277 200.1930 215.8324 229.1294 301.4255 340.3438 390.8157 464.4403 470.3107 484.4409 492.6437 532.2931 544.1047 595.2223 611.9014 643.0211 681.7740 724.9032 733.3304 790.7124 815.2914 859.8003 899.1953 923.1922 951.3489 988.0137 1013.4172 1062.9118 1067.3434 1104.8583 1111.3536 1153.7882 1216.8705 1224.7988 1246.8584 1269.1046 1283.1155 1291.0264 1304.5827 1342.0774 1358.9066 1393.6368 1413.1997 1424.3905 1468.3074 1473.3727 1475.9458 1479.8188 1486.1698 1495.6800 1575.8297 1597.2974 1633.6601 1663.3975 2951.7235 2961.5095 2977.5895 2982.9887 3004.4226 3030.9464 3055.0936 3074.6520 3078.5391 3175.2964 3547.2461 3556.1404 3573.0535 3700.2266
redmass: 5.1001 4.1536 1.5158 2.5900 3.0833 3.9743 3.3053 2.1914 1.9105 1.6333 1.6854 3.3563 3.4471 2.3627 1.8501 3.1942 2.7496 1.5546 1.2861 3.5940 4.9399 4.5154 3.6548 6.1622 3.5244 1.0912 1.2215 1.8580 4.0972 1.7490 1.2567 3.5207 3.3820 3.3768 3.4963 2.5484 1.8724 2.2172 1.8069 1.6416 1.9609 2.2301 1.3389 1.1573 1.0910 1.5849 1.4177 1.4323 1.2130 4.0001 2.7295 1.1039 1.1172 1.0423 1.5852 1.1382 1.1260 5.5935 1.4232 3.2838 5.1601 1.0685 1.0601 1.0374 1.0589 1.0993 1.0961 1.1014 1.1007 1.0996 1.0925 1.0483 1.0738 1.0769 1.1046
irintensity: 7.2409 1.3830 0.1332 2.5869 9.6669 0.4724 12.0931 20.2166 38.9566 0.0974 1.3111 5.7961 8.2041 12.9866 220.1744 9.5057 107.7820 77.2305 60.2835 14.8727 0.6409 1.7770 17.0004 18.2191 0.4692 7.8782 1.2537 74.6180 19.2341 5.0678 1.1014 4.0613 6.7139 5.8550 22.1529 6.0321 15.7862 18.1677 0.8025 25.4290 57.3463 47.0560 8.5086 14.4632 3.3191 75.4850 1.9506 27.6742 10.5525 98.9959 111.9407 4.8264 6.6709 14.2006 51.0947 5.0423 29.1657 422.4424 37.4962 568.8371 614.5598 26.0420 45.3789 25.2564 50.7867 9.0000 5.2818 45.7426 82.6606 48.6761 7.3179 58.2446 27.9877 30.7024 38.4401
temp: 298.150 k
press: 1.00000 atm
elementType: 8 7 7 7 7 6 6 6 6 6 6 6 6 1 1 1 1 1 1 1 1 1 1 1 1 1 1
symmnumber: 1
zpe: 586600.1 jmol-1
zpe.correction: 0.223424 hartree
zpe.thermalcorrener: 0.237621 hartree
zpe.thermalcorrenthalpy: 0.238565 hartree
zpe.thermalcorrgfe: 0.181158 hartree
zpe.sumelectzpe: -606.484209 hartree
zpe.sumelectthermal: -606.470013 hartree
zpe.sumelectthermalent: -606.469068 hartree
zpe.sumelectthermalfe: -606.526475 hartree
dipole: 10.2512 2.9063 -3.6214
dipole: 11.2538
quadrupole: -108.6190 -62.6977 -82.2863
quadrupole: -11.2313 7.1717 0.4414
quadrupole: -24.0847 21.8366 2.2481 -11.2313 7.1717 0.4414
hfenergy: -606.7076332 hartree
pointgroup: C01 [X(C8H14N4O1)]
dipole: -3.8099153 -2.1569283 -0.6601457 debye
polarizability: 153.692731|22.2333432|122.4466405|18.2252853|-14.0460197|90.8789832 unknown
InChI: InChI=1S/C8H14N4O/c1-2-3-4-10-6-5-7(13)12-8(9)11-6/h5,10-11H,2-4,9H2,1H3
charge 0 multiplicity 1
27 atoms
O  3.39631 1.992983 0.28203
N  -0.883763 0.63171 -1.58541
N  0.406156 -0.771837 -0.153919
N  2.52734 -0.129926 0.801823
N  1.629205 -2.252843 1.228613
C  -2.930404 0.22156 -0.12863
C  -2.146565 -0.11246 -1.422969
C  -4.235456 -0.597828 -0.000511
C  0.249644 0.472681 -0.789468
C  -5.023684 -0.260864 1.283456
C  1.241137 1.426964 -0.628915
C  1.554965 -1.002429 0.630715
C  2.455622 1.152667 0.150447
H  -3.16691 1.304056 -0.121306
H  -2.284579 0.037628 0.752959
H  -2.772833 0.113267 -2.305809
H  -1.956718 -1.205878 -1.475256
H  -3.995376 -1.681532 -0.012535
H  -4.875797 -0.412097 -0.887061
H  -0.935991 1.52663 -2.071459
H  -5.310304 0.806926 1.303619
H  -5.948804 -0.860693 1.356962
H  -4.417041 -0.461211 2.186285
H  -0.232382 -1.535991 -0.374362
H  1.143136 2.413882 -1.088129
H  0.836025 -2.883797 1.307453
H  2.465567 -2.42747 1.781077
