program: Gaussian 09
title: 000243191
version: EM64L-G09RevD.01
frameworkgroup: C1[X(C22H16ClNS)]
method: RPBEPBE
basis: SDD
operation: Freq
keyword: #p
keyword: freq=noraman
keyword: PBEPBE/SDD
title: #p freq=noraman PBEPBE/SDD
converged: YES YES NO NO
title: Mulliken charges:
elementType: Cl S N C C C C C C C C C C C C C C C C C C C C C C H H H H H H H H H H H H H H H H
charge: -0.041491 0.240762 -0.288392 0.528959 0.541834 -0.611932 -0.614808 -0.360883 0.414740 0.419261 0.422047 0.417426 -0.358716 -0.365201 -0.485111 -0.490582 -0.593606 -0.411689 -0.412279 -0.427611 -0.425900 -0.242010 -0.241676 -0.249496 -0.250039 0.261709 0.212458 0.236690 0.238358 0.238344 0.238740 0.261295 0.295003 0.252264 0.253662 0.241891 0.241891 0.227771 0.228401 0.228729 0.229188
chargesum: 0.00000
title: Mulliken charges with hydrogens summed into heavy atoms:
elementType: Cl S N C C C C C C C C C C C C C C C C C C C C C C
charge: -0.041491 0.240762 -0.288392 0.528959 0.541834 -0.611932 -0.614808 0.113283 0.414740 0.419261 0.422047 0.417426 -0.122025 -0.126843 -0.246767 -0.251843 -0.037308 -0.159425 -0.158617 -0.185720 -0.184009 -0.014239 -0.013275 -0.020767 -0.020852
polarizability: 4.08913528e+02 -3.55085814e+00 2.91452162e+02 -7.10724062e+00 -6.13099766e+01 1.77075144e+02
1716.lowfreq: -10.2674 -8.6057 -3.7833 -0.0013 0.0019 0.0022 21.2954 24.2733 39.3649
frequency: 20.9329 24.2159 39.3628 56.4736 73.4977 107.0323 114.5473 154.0282 158.7813 189.8793 210.4053 219.2231 223.6689 280.8498 299.8220 317.3996 341.1482 375.8255 398.5414 408.0294 412.2832 420.5261 431.6560 473.0070 517.5087 520.0085 527.9601 535.4487 536.1605 547.8695 558.5102 567.8410 611.9761 625.6972 645.1872 665.9787 666.3094 687.7602 754.3694 757.3857 771.7766 782.6781 786.5573 809.4828 810.4141 813.9089 817.3199 841.1751 878.2149 880.6474 910.9822 922.6958 944.8453 945.1961 949.3571 966.0947 966.7753 973.7832 989.2861 990.3025 994.2041 1026.6637 1029.5610 1051.5254 1131.4799 1137.3995 1146.7706 1161.7850 1168.1972 1172.6586 1174.4968 1179.0892 1229.0795 1236.3939 1237.1781 1253.3300 1263.1884 1270.8150 1299.4276 1320.7968 1336.5934 1348.9415 1379.2867 1397.7086 1402.1353 1408.3060 1412.6975 1425.5979 1430.3863 1443.0560 1454.3278 1463.8111 1470.2739 1504.0322 1509.4819 1561.8804 1572.3558 1592.3685 1607.8536 1627.6718 1635.4826 2918.9025 3055.7474 3084.3967 3121.4968 3121.6462 3127.7388 3128.4765 3132.4047 3133.0446 3140.2281 3147.5176 3148.1725 3155.4486 3156.1697 3163.6702 3164.3518
redmass: 10.6903 10.2455 7.3507 4.5017 5.2392 4.6191 5.3062 6.0955 3.6436 5.4765 3.9926 4.9402 5.3929 3.9457 5.8686 3.9074 5.9588 4.5451 4.1449 5.2857 4.6455 3.4462 4.6821 3.5186 3.7950 5.6523 7.0332 3.4087 3.9493 3.9982 4.6576 5.6808 5.1948 5.4438 5.3964 4.4552 4.6910 4.1464 1.3306 1.3470 4.9204 3.0599 3.0775 5.7019 3.5068 1.6917 1.4691 3.1350 1.6589 1.6645 2.1184 4.5679 1.3962 1.6306 2.0759 1.4135 1.4936 3.7157 1.3368 1.3341 3.9000 2.2878 2.2157 1.9508 1.7403 1.6833 2.7444 1.3074 1.2769 1.1534 1.1195 1.3228 1.4597 1.8533 1.8383 2.1542 1.6052 2.0019 1.3501 2.2429 2.1505 2.5873 1.4589 6.5126 3.7901 3.1279 3.5942 3.6227 3.9976 1.1040 2.4775 1.6768 1.4826 3.3763 3.6300 8.1113 8.3853 6.1573 5.9984 6.7020 7.3464 1.0711 1.0580 1.0888 1.0865 1.0867 1.0872 1.0873 1.0879 1.0879 1.1090 1.0946 1.0945 1.0960 1.0960 1.1005 1.1004
irintensity: 0.6668 1.1475 0.0779 1.1993 0.5922 0.9066 0.4163 0.5861 2.0835 2.5931 0.4334 4.8624 0.7596 0.7723 1.7890 1.7149 0.1852 1.8933 6.3190 0.4970 0.7059 19.7188 0.7977 3.9073 3.4532 2.1372 0.1116 7.3942 5.7670 1.1540 8.5668 4.7685 13.4460 1.3630 13.3387 8.4122 0.8125 5.7790 4.9753 55.6114 2.7582 5.6200 26.3139 12.7136 15.0071 45.7373 94.4492 8.6324 0.2757 5.8371 16.6504 51.4789 0.7448 1.9569 4.0932 4.3574 6.1903 0.7636 0.0351 0.0156 7.1286 12.2715 4.2393 3.0175 1.3156 5.7953 14.3789 10.7427 2.1554 13.2593 1.2767 28.7643 56.8175 4.3096 7.9365 47.1020 23.9129 55.9845 41.2865 127.4692 38.2233 7.3017 4.2229 141.5244 5.5483 3.7780 2.9874 20.2038 0.0556 11.1159 126.8295 15.5349 7.7267 36.7647 36.5821 45.8353 0.9259 65.6062 5.2909 34.9704 36.4392 75.6516 27.0038 5.3681 3.0188 2.6353 8.1566 5.1087 6.5870 7.5368 15.3964 26.8966 17.1238 5.2593 44.6250 35.9670 34.3237
temp: 298.150 k
press: 1.00000 atm
elementType: 17 16 7 6 6 6 6 6 6 6 6 6 6 6 6 6 6 6 6 6 6 6 6 6 6 1 1 1 1 1 1 1 1 1 1 1 1 1 1 1 1
symmnumber: 1
zpe: 823008.7 jmol-1
zpe.correction: 0.313467 hartree
zpe.thermalcorrener: 0.333379 hartree
zpe.thermalcorrenthalpy: 0.334323 hartree
zpe.thermalcorrgfe: 0.263436 hartree
zpe.sumelectzpe: -1759.134037 hartree
zpe.sumelectthermal: -1759.114126 hartree
zpe.sumelectthermalent: -1759.113182 hartree
zpe.sumelectthermalfe: -1759.184069 hartree
dipole: 0.7307 1.3584 -3.3968
dipole: 3.7306
quadrupole: -138.7704 -142.5285 -163.5391
quadrupole: 2.3049 -0.7626 -18.9906
quadrupole: 9.5089 5.7508 -15.2597 2.3049 -0.7626 -18.9906
hfenergy: -1759.4475048 hartree
pointgroup: C01 [X(C22H16Cl1N1S1)]
dipole: 0.2814586 0.7175125 -1.2490655 debye
polarizability: 409.0886479|0.9946244|305.6693192|-3.290391|-44.0324348|162.6828673 unknown
InChI: InChI=1S/C22H16ClNS/c23-13-14-24-19-11-9-15-5-1-3-7-17(15)21(19)25-22-18-8-4-2-6-16(18)10-12-20(22)24/h1-12H,13-14H2
charge 0 multiplicity 1
41 atoms
Cl 0.075635 3.588869 2.739572
S  -0.054037 -0.824096 1.296607
N  -0.012894 1.862842 -0.099871
C  -1.256618 1.172505 -0.242091
C  1.214978 1.143466 -0.225857
C  -1.425215 -0.116071 0.291095
C  1.341393 -0.154225 0.298795
C  0.006782 3.33536 -0.070587
C  -2.645516 -0.85147 0.118074
C  2.540956 -0.923995 0.128688
C  -3.744277 -0.213342 -0.584665
C  3.665866 -0.311569 -0.555672
C  -2.33817 1.764616 -0.9801
C  2.328522 1.717981 -0.929968
C  -3.552456 1.098681 -1.123446
C  3.522905 1.016115 -1.070934
C  0.863519 3.916932 1.060781
C  -2.84358 -2.174673 0.638414
C  2.692308 -2.259998 0.631932
C  -4.98566 -0.913772 -0.72932
C  4.885561 -1.049248 -0.699867
C  -4.065795 -2.831506 0.478784
C  3.894056 -2.953493 0.47256
C  -5.150569 -2.197776 -0.206402
C  5.004376 -2.345418 -0.194784
H  -1.02751 3.68862 0.064263
H  0.373289 3.768726 -1.028996
H  -2.200274 2.744009 -1.448683
H  2.234767 2.716037 -1.368935
H  -4.37342 1.57241 -1.673885
H  4.367755 1.475764 -1.596783
H  0.931088 5.012465 0.971652
H  1.866688 3.470951 1.113238
H  -2.015729 -2.670877 1.155846
H  1.844199 -2.736216 1.13503
H  -5.808258 -0.42143 -1.261785
H  5.72823 -0.576223 -1.218284
H  -4.196864 -3.843338 0.877943
H  3.988994 -3.974659 0.857842
H  -6.10374 -2.725034 -0.321095
H  5.94072 -2.901821 -0.310207
