program: Gaussian 09
title: 000243158
version: EM64L-G09RevD.01
frameworkgroup: C1[X(C11H12N4O)]
method: RPBEPBE
basis: SDD
operation: Freq
keyword: #p
keyword: freq=noraman
keyword: PBEPBE/SDD
title: #p freq=noraman PBEPBE/SDD
converged: YES YES NO NO
title: Mulliken charges:
elementType: O N N N N C C C C C C C C C C C H H H H H H H H H H H H
charge: -0.250660 -0.406415 -0.459583 -0.039881 -0.627221 -0.549618 0.464940 0.466656 -0.438043 -0.371064 -0.473683 0.149092 -0.214746 -0.220694 -0.237855 0.038979 0.234224 0.219583 0.313804 0.233403 0.252486 0.317476 0.243891 0.231073 0.234227 0.234398 0.304477 0.350753
chargesum: 0.00000
title: Mulliken charges with hydrogens summed into heavy atoms:
elementType: O N N N N C C C C C C C C C C C
charge: -0.250660 -0.092610 -0.142107 -0.039881 0.028009 -0.095810 0.464940 0.466656 -0.204640 -0.118578 -0.229792 0.149092 0.016328 0.013532 -0.003458 0.038979
polarizability: 2.10414191e+02 -1.18671717e+01 1.53747312e+02 -1.37322822e+01 7.65558748e+00 9.43435625e+01
1716.lowfreq: -6.1884 -0.0008 0.0004 0.0005 2.1440 3.5177 7.3540 30.5811 32.2851
frequency: -0.9979 30.4758 32.2717 118.1597 127.9347 146.5934 191.7549 209.9065 261.0977 279.2088 289.7152 339.7676 399.3327 402.9052 475.8908 491.4616 498.8744 516.2087 542.9511 549.1833 573.6877 593.3080 616.2702 624.9578 663.5333 685.4199 706.2486 727.9067 755.2694 806.3951 821.3520 857.2793 863.6579 917.6365 955.4021 966.8959 981.1188 989.6628 1001.0148 1023.5061 1027.8959 1055.3580 1088.5214 1109.1102 1174.5201 1189.0174 1203.2904 1213.9130 1226.1699 1242.1006 1303.4732 1315.2488 1348.3656 1386.4537 1415.6259 1420.2529 1442.8865 1468.9059 1478.1248 1486.1552 1572.1187 1595.3701 1595.8488 1612.8888 1632.2141 1661.6361 2977.6332 3031.1463 3117.6312 3125.0414 3137.0196 3149.5473 3166.6117 3177.7509 3537.3079 3542.5349 3551.2478 3691.7784
redmass: 5.8340 4.2839 4.6314 4.4783 4.7330 4.8528 5.7909 5.2746 3.1629 1.1937 3.8265 2.9746 2.9194 2.8029 4.2965 1.6227 2.7840 2.6477 1.4288 1.7447 4.0706 3.8812 6.0436 4.5295 4.0502 6.0791 1.9100 3.8934 1.7038 3.7637 1.7932 1.2713 3.9858 1.3665 3.5150 2.0695 1.3890 6.2484 1.3287 2.7663 2.4757 3.8122 1.5796 1.8716 1.0561 1.1125 2.3395 2.2383 1.4959 2.0499 1.6123 1.3323 1.3278 6.0009 4.0002 3.2004 2.1205 1.4962 1.5648 1.6867 5.1506 2.2867 2.5647 5.9294 3.2359 5.1175 1.0605 1.1018 1.0879 1.0871 1.0909 1.0959 1.1015 1.0927 1.0677 1.0544 1.0762 1.1041
irintensity: 3.2318 3.1166 2.4244 0.7746 2.2186 5.8338 3.3916 3.7075 5.2506 86.8701 3.6080 19.5697 9.5995 0.9723 7.3762 200.0902 77.9472 70.4967 51.0314 106.9553 18.4091 13.6414 0.3878 0.6653 43.3269 16.6163 40.9559 0.4837 51.5603 19.2684 60.0097 1.4855 16.8942 1.2111 4.1415 3.8110 0.0455 0.5102 0.2951 16.5837 1.4395 47.9112 6.0815 10.9254 0.1904 2.5626 6.2461 38.0165 96.8471 17.9752 112.8110 8.0784 1.2272 7.7715 96.1825 187.3766 9.5904 59.1468 17.1325 10.9074 431.7719 49.3344 15.2567 8.3250 607.1499 527.5442 47.1192 20.8679 8.3291 3.3430 7.9828 33.6054 21.1597 7.5432 20.4120 67.5350 27.7463 38.8953
temp: 298.150 k
press: 1.00000 atm
elementType: 8 7 7 7 7 6 6 6 6 6 6 6 6 6 6 6 1 1 1 1 1 1 1 1 1 1 1 1
symmnumber: 1
zpe: 577227.7 jmol-1
zpe.correction: 0.219854 hartree
zpe.thermalcorrener: 0.233273 hartree
zpe.thermalcorrenthalpy: 0.234217 hartree
zpe.thermalcorrgfe: 0.178792 hartree
zpe.sumelectzpe: -719.456904 hartree
zpe.sumelectthermal: -719.443485 hartree
zpe.sumelectthermalent: -719.442541 hartree
zpe.sumelectthermalfe: -719.497966 hartree
dipole: 7.0996 -7.5974 0.4129
dipole: 10.4065
quadrupole: -110.8223 -90.7072 -91.0259
quadrupole: 28.3757 -6.6138 -0.8530
quadrupole: -13.3038 6.8112 6.4926 28.3757 -6.6138 -0.8530
hfenergy: -719.6767582 hartree
pointgroup: C01 [X(C11H12N4O1)]
dipole: 2.753879 -2.8504475 -1.0264953 debye
polarizability: 208.1484344|-4.6563968|141.8938793|-23.0262732|25.1148099|108.4627514 unknown
InChI: InChI=1S/C11H12N4O/c12-11-14-9(6-10(16)15-11)13-7-8-4-2-1-3-5-8/h1-6,13-14H,7,12H2
charge 0 multiplicity 1
28 atoms
O  -3.717555 2.365029 0.849755
N  0.069009 0.094916 -1.197636
N  -1.795063 -1.069142 -0.284358
N  -3.665901 0.014162 0.793752
N  -3.593013 -2.324271 0.599583
C  1.091799 -0.96264 -1.019869
C  2.383458 -0.431929 -0.397602
C  -1.142555 0.159067 -0.508891
C  3.630386 -0.659286 -1.028899
C  2.348832 0.294593 0.821562
C  -1.75847 1.324973 -0.087719
C  -3.03408 -1.070513 0.393036
C  4.82776 -0.177085 -0.450516
C  3.542722 0.778184 1.398826
C  4.786506 0.542284 0.765055
C  -3.096612 1.30896 0.524688
H  1.322766 -1.440409 -1.991947
H  0.661056 -1.743631 -0.364102
H  0.426464 0.997803 -1.514883
H  3.666967 -1.212034 -1.976162
H  1.387096 0.484886 1.313679
H  -1.517221 -1.883512 -0.834671
H  -1.263656 2.292008 -0.206961
H  5.786471 -0.357939 -0.949097
H  3.505093 1.33717 2.340322
H  5.712356 0.919136 1.213366
H  -3.039593 -3.177903 0.591881
H  -4.504322 -2.328677 1.053308
