program: Gaussian 09
title: 000243163
version: EM64L-G09RevD.01
frameworkgroup: C1[X(C12H17N5O2S)]
method: RPBEPBE
basis: SDD
operation: Freq
keyword: #p
keyword: freq=noraman
keyword: PBEPBE/SDD
title: #p freq=noraman PBEPBE/SDD
converged: YES YES NO NO
title: Mulliken charges:
elementType: S O O N N N N N C C C C C C C C C C C C H H H H H H H H H H H H H H H H H
charge: 0.321390 -0.417362 -0.214079 -0.171704 -0.049277 -0.065928 -0.065023 -0.590701 -0.398475 -0.019276 -0.414949 -0.715315 -0.713489 0.167125 0.087102 -0.239687 -0.334786 -0.048179 -0.695474 0.217379 0.230829 0.212585 0.208383 0.228182 0.258384 0.215894 0.219526 0.208490 0.215490 0.221316 0.210785 0.266977 0.311072 0.311301 0.329217 0.328615 0.383664
chargesum: 0.00000
title: Mulliken charges with hydrogens summed into heavy atoms:
elementType: S O O N N N N N C C C C C C C C C C C C
charge: 0.321390 -0.033698 -0.214079 -0.171704 -0.049277 -0.065928 -0.065023 0.067131 0.044938 0.189106 0.071617 -0.071405 -0.065898 0.167125 0.087102 0.027290 -0.334786 -0.048179 -0.073101 0.217379
polarizability: 2.84632456e+02 1.02706749e+01 2.07302507e+02 9.41713277e+00 5.67629695e-01 1.03026563e+02
1716.lowfreq: -0.0014 -0.0008 -0.0005 2.7115 4.8867 9.0244 20.7076 23.3935 24.1011
frequency: 20.6546 23.3586 23.7825 25.7938 47.6795 68.7397 85.0462 94.6582 122.3634 152.8063 164.0595 175.1715 187.7840 217.9522 227.4949 233.4151 243.5133 308.3257 338.5939 356.8242 361.8653 378.8297 399.1989 421.9711 436.7376 487.5011 496.4988 508.9938 515.2922 561.9800 570.7758 591.4266 628.2297 633.2945 644.0477 714.0104 731.1288 749.7106 767.9045 781.1447 791.9787 802.2553 816.3157 873.7446 881.3805 897.8851 911.6271 950.4571 959.0946 960.4501 981.1495 995.1082 1038.5536 1045.4080 1085.5292 1126.3442 1130.7650 1137.5331 1188.0453 1193.0232 1196.4256 1225.1421 1270.4458 1285.8231 1289.4064 1306.9232 1317.6683 1323.7804 1334.1377 1335.7193 1352.8667 1371.0855 1380.6456 1381.2868 1398.7628 1409.4204 1435.2451 1459.2402 1465.3797 1476.7623 1481.4021 1485.1215 1493.1031 1501.6814 1522.9900 1574.2147 1606.1409 1674.3018 2965.4078 2970.8105 2975.2107 2984.6665 3020.1861 3036.5622 3051.0782 3062.2666 3068.3598 3071.0550 3073.4033 3088.9560 3113.1529 3226.9893 3516.9255 3567.1758 3725.9843
redmass: 6.1746 6.4351 3.2915 4.6630 5.4135 6.5397 3.0214 2.0527 6.9195 5.1171 5.4997 5.9455 3.9510 5.6185 1.1600 2.3255 1.2263 4.9123 3.4841 2.5805 2.5508 6.2904 4.4483 9.8516 1.2038 3.4061 1.7557 1.0695 5.0138 4.4307 4.5078 8.0248 1.3670 5.0877 5.1261 11.5118 4.7409 6.3166 1.2868 4.6588 3.7728 4.7634 1.8618 5.1668 8.9406 1.7967 1.1997 1.3492 2.3597 3.7611 1.9522 1.9909 2.2565 2.1953 2.3120 2.7821 2.3468 1.1376 2.0005 1.9076 1.9549 1.3465 1.4896 1.8972 2.2670 4.4146 2.3572 2.0141 1.4838 2.0349 1.6890 1.6231 4.1442 1.2238 1.2201 1.0863 3.0889 1.1947 1.0461 1.1757 1.0656 1.0671 1.0613 2.6384 8.1900 9.5789 1.5271 8.8131 1.0770 1.0357 1.0366 1.0661 1.0611 1.0998 1.0586 1.0994 1.0998 1.0983 1.0993 1.1047 1.1032 1.0981 1.0640 1.0441 1.1059
irintensity: 0.4307 0.9250 0.0526 0.0478 0.1672 1.5691 3.2167 0.0650 0.2842 0.3116 6.4855 4.6269 1.8426 0.3674 0.1063 0.0581 0.1980 1.5853 8.0878 0.7881 3.2166 7.5885 0.4532 8.5390 294.8688 2.2977 28.0110 4.0440 1.8252 24.6465 39.9643 0.2035 143.7827 9.6626 11.8714 5.8820 28.1070 14.6776 5.6169 17.9004 5.6439 2.3323 6.6582 21.1657 92.4979 9.2047 1.8055 1.6346 4.4125 14.6359 2.3183 10.3867 8.7667 356.0668 1.7044 38.0641 12.0951 0.0834 8.2268 3.2235 65.7479 0.0441 14.1516 28.2736 3.1084 79.5413 28.4709 49.1021 11.0067 10.6167 0.2331 36.0143 48.6290 16.0655 15.3488 61.2243 67.1619 16.7354 1.8815 20.0698 0.6661 22.6350 26.2634 180.1124 275.1757 241.2756 416.0450 185.8861 14.4263 34.2901 27.0245 24.0706 33.7064 14.9832 12.8030 17.2649 20.0046 101.6849 64.0639 13.1629 0.4161 0.0973 28.3974 114.0295 44.0399
temp: 298.150 k
press: 1.00000 atm
elementType: 16 8 8 7 7 7 7 7 6 6 6 6 6 6 6 6 6 6 6 6 1 1 1 1 1 1 1 1 1 1 1 1 1 1 1 1 1
symmnumber: 1
zpe: 760457.2 jmol-1
zpe.correction: 0.289643 hartree
zpe.thermalcorrener: 0.310459 hartree
zpe.thermalcorrenthalpy: 0.311403 hartree
zpe.thermalcorrgfe: 0.236491 hartree
zpe.sumelectzpe: -1288.265970 hartree
zpe.sumelectthermal: -1288.245153 hartree
zpe.sumelectthermalent: -1288.244209 hartree
zpe.sumelectthermalfe: -1288.319121 hartree
dipole: -3.9111 4.6315 0.1267
dipole: 6.0633
quadrupole: -101.1660 -124.1059 -126.3731
quadrupole: 19.0692 0.9290 0.5286
quadrupole: 16.0490 -6.8909 -9.1581 19.0692 0.9290 0.5286
hfenergy: -1288.5556124 hartree
pointgroup: C01 [X(C12H17N5O2S1)]
dipole: -1.5344826 -1.8264075 -0.0122655 debye
polarizability: 284.386908|-10.163559|207.2529272|-11.8670319|-0.2343396|103.3216905 unknown
InChI: InChI=1S/C12H17N5O2S/c1-7(2)3-4-17-6-14-9-10(17)15-12(13)16-11(9)20-5-8(18)19/h6-7,18H,3-5,13H2,1-2H3
charge 0 multiplicity 1
37 atoms
S  3.098054 1.143421 -0.098415
O  6.601482 -0.855156 -0.50335
O  6.090614 1.413382 -0.453065
N  -1.902542 0.857079 0.485792
N  -0.043933 2.197715 0.255282
N  -0.822541 -1.363713 0.383974
N  1.621422 -1.183671 0.107831
N  0.555385 -3.262361 0.267081
C  -3.972524 0.328723 -0.81865
C  -5.476495 -0.066004 -0.795853
C  -3.318642 0.456592 0.578511
C  -6.362268 1.013933 -0.126092
C  -5.712715 -1.456169 -0.155199
C  -0.814225 -0.006017 0.36568
C  0.332076 0.841161 0.227932
C  -1.378006 2.163019 0.405742
C  1.574546 0.17212 0.094064
C  0.437391 -1.889882 0.253712
C  4.303681 -0.298047 -0.22148
C  5.711416 0.226514 -0.399754
H  -3.405958 -0.428511 -1.394544
H  -3.858717 1.29339 -1.352622
H  -5.786958 -0.134899 -1.85955
H  -3.844905 1.205659 1.196347
H  -3.34789 -0.510764 1.108137
H  -6.200812 2.008374 -0.583433
H  -7.433337 0.761995 -0.234365
H  -6.15474 1.097703 0.957682
H  -6.762288 -1.775566 -0.292795
H  -5.059896 -2.224447 -0.609791
H  -5.514437 -1.442801 0.933112
H  -2.01879 3.040172 0.473501
H  4.021755 -0.942888 -1.068634
H  4.233729 -0.914457 0.68867
H  1.475482 -3.681381 0.171731
H  -0.279434 -3.830939 0.374826
H  7.52672 -0.505581 -0.619009
