program: Gaussian 09
title: 000243161
version: EM64L-G09RevD.01
frameworkgroup: C1[X(C12H17N5O2S)]
method: RPBEPBE
basis: SDD
operation: Freq
keyword: #p
keyword: freq=noraman
keyword: PBEPBE/SDD
title: #p freq=noraman PBEPBE/SDD
converged: YES YES NO NO
title: Mulliken charges:
elementType: S O O N N N N N C C C C C C C C C C C C H H H H H H H H H H H H H H H H H
charge: 0.321542 -0.417292 -0.213984 -0.168819 -0.050185 -0.065647 -0.064151 -0.590021 -0.014086 -0.408783 -0.360396 -0.729240 0.165309 -0.705240 -0.243375 0.085988 -0.335188 -0.053288 -0.695382 0.217378 0.236220 0.238059 0.207372 0.221805 0.183867 0.218128 0.205060 0.228803 0.214204 0.220448 0.214996 0.271091 0.311578 0.311013 0.328927 0.329490 0.383800
chargesum: 0.00000
title: Mulliken charges with hydrogens summed into heavy atoms:
elementType: S O O N N N N N C C C C C C C C C C C C
charge: 0.321542 -0.033492 -0.213984 -0.168819 -0.050185 -0.065647 -0.064151 0.068396 0.222134 0.036648 0.045277 -0.077250 0.165309 -0.055592 0.027716 0.085988 -0.335188 -0.053288 -0.072791 0.217378
polarizability: 2.76777233e+02 -5.55739215e+00 2.02185393e+02 -1.79261144e+01 9.64726332e+00 1.14528641e+02
1716.lowfreq: -21.6967 -5.0225 -0.0015 -0.0008 -0.0007 2.6923 15.2045 17.6953 23.3586
frequency: 6.0093 16.5492 23.2485 36.2935 42.6659 67.4988 77.9066 88.0745 114.4034 153.7407 169.0050 176.7556 190.3847 194.8340 208.1419 241.2972 251.3504 290.6293 309.6267 344.6178 366.7078 379.9632 401.2135 421.8654 440.1582 476.0408 496.2029 508.8500 512.7959 548.6651 567.0133 591.5832 628.6111 632.4069 644.3786 714.5482 737.0178 749.4398 760.8617 780.9662 794.5490 800.5144 814.7589 873.9785 877.6215 897.5340 897.7476 922.7625 960.4725 967.4701 991.0289 1038.3607 1045.6230 1048.8829 1084.1719 1122.6688 1136.6738 1141.5121 1156.9185 1192.3203 1197.2614 1225.4590 1265.9503 1285.6717 1287.9982 1306.3351 1316.3028 1320.0864 1327.1572 1341.0404 1350.4825 1362.7444 1379.9212 1385.6260 1392.9378 1408.5413 1432.2212 1458.4895 1464.6282 1474.8661 1477.6462 1484.7049 1488.5151 1499.8085 1522.0164 1572.8638 1606.4082 1674.5587 2955.1890 2971.6161 2978.0114 2984.5235 3001.1244 3019.1820 3050.5373 3059.9959 3066.7940 3072.5630 3075.9356 3086.1492 3112.8023 3228.9314 3517.8453 3566.9768 3725.7206
redmass: 4.1131 5.4510 9.5392 3.4088 3.4779 4.0653 2.9918 2.7469 5.5412 5.4625 6.5716 6.8610 1.2377 3.3646 1.5458 2.7922 2.2942 3.0392 3.4868 4.4110 6.4238 5.4762 2.0535 9.9395 1.1983 3.0440 1.7650 2.3671 1.4861 4.9753 4.8944 7.9210 1.3622 5.0047 5.3520 11.1417 4.6711 6.3949 1.7478 4.4976 1.6457 6.6529 1.7388 5.1973 5.2770 1.8146 1.8014 1.6618 4.8725 1.2031 1.7380 2.2919 2.1944 3.0251 2.2414 4.1244 1.1376 2.1582 2.0351 2.2163 1.9173 1.3471 1.3443 2.0347 2.0713 4.0667 1.6924 1.6998 2.0340 2.0093 1.7075 1.6964 4.6946 1.2453 1.2080 1.0864 2.8208 1.2659 1.1120 1.0485 1.0734 1.0577 1.0472 2.9575 8.5393 9.5661 1.5231 8.8217 1.0630 1.0390 1.0363 1.0793 1.0612 1.0980 1.0586 1.1009 1.1021 1.1001 1.0995 1.0978 1.1032 1.0981 1.0640 1.0441 1.1059
irintensity: 0.3717 0.1883 0.9782 0.0864 0.0289 1.3713 2.9841 0.7558 0.1853 5.8187 1.1769 4.0000 0.1298 0.3176 0.2500 0.2728 0.8520 0.1346 2.1048 7.5142 2.4507 8.7017 0.1348 7.6114 294.6336 1.4086 27.6448 3.3395 3.1150 0.4794 63.5491 0.2095 144.0579 10.8755 11.7487 7.0157 20.7588 13.6652 2.9008 20.0362 4.0291 1.3622 8.1379 33.2609 78.7697 13.6465 6.9909 7.4254 22.6590 8.2244 8.1738 8.6219 357.9409 0.0795 1.3412 65.5736 0.0050 0.6211 6.4600 1.4015 56.1429 0.0723 12.1353 9.7974 12.7818 67.7105 32.4499 14.9963 37.4191 10.2793 9.5167 23.4862 62.2050 13.3980 13.6761 61.2311 55.3139 23.6929 12.9844 16.8460 9.1528 14.5251 7.7266 180.6026 286.1142 234.3543 418.7431 185.8135 25.6919 30.3101 34.3428 2.4210 41.5289 31.4918 12.6559 6.0704 28.5999 72.5219 47.2669 34.4962 0.4067 0.1184 28.5755 115.4599 43.6251
temp: 298.150 k
press: 1.00000 atm
elementType: 16 8 8 7 7 7 7 7 6 6 6 6 6 6 6 6 6 6 6 6 1 1 1 1 1 1 1 1 1 1 1 1 1 1 1 1 1
symmnumber: 1
zpe: 759102.5 jmol-1
zpe.correction: 0.289127 hartree
zpe.thermalcorrener: 0.310133 hartree
zpe.thermalcorrenthalpy: 0.311077 hartree
zpe.thermalcorrgfe: 0.234435 hartree
zpe.sumelectzpe: -1288.267949 hartree
zpe.sumelectthermal: -1288.246943 hartree
zpe.sumelectthermalent: -1288.245999 hartree
zpe.sumelectthermalfe: -1288.322641 hartree
dipole: 3.4286 4.7133 0.2820
dipole: 5.8352
quadrupole: -102.5090 -124.2125 -125.4630
quadrupole: -17.1005 -6.3535 1.0514
quadrupole: 14.8858 -6.8177 -8.0681 -17.1005 -6.3535 1.0514
hfenergy: -1288.557076 hartree
pointgroup: C01 [X(C12H17N5O2S1)]
dipole: 1.337209 1.7884749 0.5326446 debye
polarizability: 277.0841345|-1.298839|193.6194514|-17.5747888|27.6580442|122.7876819 unknown
InChI: InChI=1S/C12H17N5O2S/c1-3-7(2)4-17-6-14-9-10(17)15-12(13)16-11(9)20-5-8(18)19/h6-7,18H,3-5,13H2,1-2H3
charge 0 multiplicity 1
37 atoms
S  -2.869808 -1.146243 -0.368591
O  -6.408184 0.464594 0.779975
O  -5.839747 -1.630879 -0.053482
N  2.07752 -0.448654 -1.059336
N  0.27173 -1.871324 -1.213537
N  0.949529 1.54633 -0.131706
N  -1.466034 1.167458 0.191212
N  -0.464294 3.216063 0.722631
C  4.194233 0.112198 0.222957
C  3.458984 0.0560 -1.145094
C  4.360552 -1.302427 0.836342
C  5.547087 0.833339 0.02031
C  0.977947 0.26618 -0.585133
C  4.925922 -1.300255 2.27379
C  1.590233 -1.722452 -1.418519
C  -0.134727 -0.629133 -0.689669
C  -1.383727 -0.104582 -0.272141
C  -0.312048 1.933911 0.242818
C  -4.105998 0.117453 0.281924
C  -5.493514 -0.484753 0.29541
H  3.568561 0.721839 0.906424
H  3.417452 1.071095 -1.580885
H  4.013059 -0.597114 -1.84619
H  3.375397 -1.809532 0.843517
H  5.022406 -1.904797 0.17801
H  5.403229 1.838478 -0.418095
H  6.207394 0.256229 -0.656448
H  6.079864 0.963396 0.977794
H  4.293003 -0.689416 2.944875
H  4.959527 -2.325372 2.685313
H  5.952118 -0.892509 2.311893
H  2.247115 -2.487942 -1.827045
H  -4.080965 1.015986 -0.354613
H  -3.81174 0.43313 1.295214
H  0.347335 3.824245 0.779021
H  -1.386894 3.533069 1.004773
H  -7.320115 0.064592 0.786079
