program: Gaussian 09
title: 000243176
version: EM64L-G09RevD.01
frameworkgroup: C1[X(C14H10N2O4)]
method: RPBEPBE
basis: SDD
operation: Freq
keyword: #p
keyword: freq=noraman
keyword: PBEPBE/SDD
title: #p freq=noraman PBEPBE/SDD
converged: YES YES NO NO
title: Mulliken charges:
elementType: O O O O N N C C C C C C C C C C C C C C H H H H H H H H H H
charge: -0.434067 -0.250166 -0.204074 -0.191809 0.023633 0.006543 0.254934 0.167989 0.231532 -0.356356 -0.296555 0.394831 -0.370694 -0.231427 -0.211684 0.122021 -0.298341 -0.487811 -0.202805 -0.345081 0.261914 0.207534 0.287885 0.241084 0.244757 0.233780 0.335138 0.234550 0.247274 0.385472
chargesum: 0.00000
title: Mulliken charges with hydrogens summed into heavy atoms:
elementType: O O O O N N C C C C C C C C C C C C C C
charge: -0.048595 -0.250166 -0.204074 -0.191809 0.023633 0.006543 0.254934 0.167989 0.231532 -0.094441 -0.089022 0.394831 -0.082808 0.009657 0.033073 0.122021 -0.064561 -0.152674 0.031745 -0.097808
polarizability: 3.20477458e+02 -1.00733475e+00 1.81617087e+02 -7.07978018e+00 2.74743650e+00 1.05314060e+02
1716.lowfreq: -10.0847 -4.6393 -0.0010 -0.0008 -0.0006 4.8943 22.6084 32.4485 41.4296
frequency: 22.5175 32.4150 41.4102 66.8050 76.4577 105.0380 138.2974 143.7364 165.9239 188.7297 234.2155 274.5360 298.8493 309.5294 344.7140 391.1727 408.3095 425.0463 440.9618 491.3060 498.9128 542.3361 556.4876 596.2840 613.3287 620.5113 641.9204 670.1170 681.7562 713.6736 730.1257 739.1350 750.1666 782.2708 785.8541 809.8962 835.6468 891.5930 924.0149 941.8260 959.7592 976.9620 985.1231 990.6123 1000.6118 1001.7124 1028.6117 1039.0867 1049.7282 1068.4473 1125.9682 1137.8014 1174.4516 1194.2330 1204.1619 1209.7867 1246.3393 1267.8772 1282.7988 1311.0451 1351.5764 1360.8316 1376.4418 1387.0671 1429.5938 1436.9648 1455.2762 1470.0038 1534.6190 1573.0181 1576.4661 1605.2265 1607.4556 1644.1865 3070.2756 3120.3399 3133.8395 3140.5810 3155.3013 3165.5173 3169.1399 3186.9938 3187.7047 3527.5104
redmass: 7.5969 6.4287 8.5742 5.7130 8.1604 5.7933 5.5215 6.7363 7.5957 6.1308 5.9058 5.9011 6.5218 4.1457 8.2258 4.0683 5.0408 4.3426 4.0853 3.6678 4.8415 4.3376 5.4712 4.9676 7.0768 1.4216 5.9512 5.2770 7.7207 1.9685 4.6462 5.8126 5.0058 4.0047 1.8733 1.6528 5.5496 1.4140 1.3803 1.4065 6.7556 1.3773 1.4242 1.4556 3.8171 1.3594 3.3677 2.8781 2.9117 2.4054 1.7115 1.8666 1.1041 1.7939 2.2578 3.1299 2.5242 1.7078 2.2458 5.2348 1.3715 10.9740 3.4763 2.3199 2.3515 1.7163 1.9466 2.6732 4.8774 6.3052 5.6818 7.0717 7.1167 7.7097 1.0862 1.0894 1.0905 1.0866 1.0915 1.0992 1.0964 1.0971 1.0946 1.0641
irintensity: 0.8291 1.8561 0.1209 0.9128 0.3023 0.2969 0.7184 2.6721 0.3732 0.7303 9.9372 4.1456 1.1492 0.9172 1.2428 1.7476 3.1320 2.2082 5.7514 2.8475 7.0568 2.4243 17.0002 40.7832 6.8048 101.8387 15.9014 20.3930 11.1832 31.8342 5.1923 17.1494 13.5658 28.9039 39.1693 21.7770 9.8961 4.6089 10.1260 5.6555 9.3362 1.1061 8.5744 3.2668 10.5678 1.3547 88.7140 49.9289 252.5102 27.4370 14.8946 4.1347 12.9320 10.8597 109.2882 111.8321 9.0440 4.5964 16.9441 1.7822 8.3816 238.3112 16.6209 61.6510 8.6411 23.6795 16.4096 49.9209 12.7297 15.6929 25.9289 54.7666 45.5075 128.3406 19.5067 6.9625 14.5432 1.6317 9.8898 31.4756 11.5153 7.9312 22.3465 58.7106
temp: 298.150 k
press: 1.00000 atm
elementType: 8 8 8 8 7 7 6 6 6 6 6 6 6 6 6 6 6 6 6 6 1 1 1 1 1 1 1 1 1 1
symmnumber: 1
zpe: 561329.0 jmol-1
zpe.correction: 0.213799 hartree
zpe.thermalcorrener: 0.230548 hartree
zpe.thermalcorrenthalpy: 0.231492 hartree
zpe.thermalcorrgfe: 0.167187 hartree
zpe.sumelectzpe: -948.390230 hartree
zpe.sumelectthermal: -948.373481 hartree
zpe.sumelectthermalent: -948.372536 hartree
zpe.sumelectthermalfe: -948.436841 hartree
dipole: -1.6517 7.2060 1.4016
dipole: 7.5245
quadrupole: -109.1297 -109.2511 -115.9333
quadrupole: 3.5462 -11.2858 -6.7189
quadrupole: 2.3083 2.1869 -4.4952 3.5462 -11.2858 -6.7189
hfenergy: -948.6040285 hartree
pointgroup: C01 [X(C14H10N2O4)]
dipole: 0.922829 2.4291192 1.4183047 debye
polarizability: 319.7838581|-9.7492041|152.0640995|-5.9068213|37.9290192|135.5606472 unknown
InChI: InChI=1S/C14H10N2O4/c17-14(18)12(8-10-4-3-7-15-9-10)11-5-1-2-6-13(11)16(19)20/h1-9,17H
charge 0 multiplicity 1
30 atoms
O  1.259659 -0.268759 -2.522339
O  -0.966366 -0.875889 -2.416423
O  3.461629 -2.681646 -0.124975
O  1.229083 -2.350536 -0.390025
N  2.421888 -1.916624 -0.143783
N  -4.567353 -0.12954 -0.637545
C  1.532476 0.453936 0.040612
C  0.149161 0.130671 -0.451273
C  2.608768 -0.474016 0.155063
C  1.813825 1.794213 0.418298
C  -0.900705 0.442591 0.3927
C  -2.370226 0.396342 0.347408
C  3.893977 -0.089974 0.599194
C  3.088181 2.191952 0.87491
C  4.137328 1.24813 0.959714
C  0.037689 -0.399078 -1.838275
C  -3.041995 0.950656 1.482704
C  -3.203322 -0.145479 -0.68495
C  -4.446333 0.967842 1.543224
C  -5.170066 0.423728 0.456574
H  1.01687 2.537824 0.315321
H  -0.551379 0.829181 1.363986
H  4.67385 -0.853113 0.661834
H  3.263688 3.237478 1.149382
H  5.131295 1.549281 1.304601
H  -2.452701 1.366989 2.309382
H  -2.754873 -0.612828 -1.563048
H  -4.972498 1.389521 2.405091
H  -6.266219 0.421099 0.45149
H  1.153066 -0.658352 -3.431548
