program: Gaussian 09
title: 000243162
version: EM64L-G09RevD.01
frameworkgroup: C1[X(C17H20FN5S)]
method: RPBEPBE
basis: SDD
operation: Freq
keyword: #p
keyword: freq=noraman
keyword: PBEPBE/SDD
title: #p freq=noraman PBEPBE/SDD
converged: YES YES NO NO
title: Mulliken charges:
elementType: S F N N N N N C C C C C C C C C C C C C C C C C H H H H H H H H H H H H H H H H H H H H
charge: 0.276822 -0.200129 -0.171960 -0.050744 -0.068747 -0.057610 -0.590949 -0.398154 -0.018477 -0.411921 -0.716434 -0.713416 0.168571 0.088024 -0.242073 -0.337456 -0.051330 -0.781596 0.314466 0.169162 -0.319244 -0.360489 -0.236894 -0.199299 0.234296 0.211448 0.207884 0.225906 0.255140 0.215699 0.218808 0.208950 0.214592 0.222236 0.209616 0.265009 0.306829 0.288056 0.247777 0.328895 0.327042 0.255333 0.231407 0.234957
chargesum: 0.00000
title: Mulliken charges with hydrogens summed into heavy atoms:
elementType: S F N N N N N C C C C C C C C C C C C C C C C C
charge: 0.276822 -0.200129 -0.171960 -0.050744 -0.068747 -0.057610 0.064988 0.047590 0.189407 0.069124 -0.072978 -0.066973 0.168571 0.088024 0.022937 -0.337456 -0.051330 -0.186710 0.314466 0.169162 -0.071467 -0.105156 -0.005487 0.035658
polarizability: 3.81492252e+02 -5.07751929e+00 2.18294352e+02 4.07554843e+00 1.54090786e+00 1.61626641e+02
1716.lowfreq: -18.8948 -6.4714 -5.7663 -0.0019 -0.0015 -0.0013 0.7587 8.2175 14.4656
frequency: -14.3177 -2.3724 14.0478 17.9038 30.6651 42.9503 65.4489 93.2209 107.5426 119.7580 135.0171 162.5773 179.1223 193.3538 213.9369 215.5239 232.4658 237.8648 275.8256 287.9395 307.6104 339.0564 353.7595 361.9409 398.9057 407.5161 421.4584 431.7894 458.6288 482.4345 506.2155 508.4882 517.1893 529.1303 563.1307 577.7991 590.6837 626.1527 641.7449 660.4193 713.4923 730.8959 735.6414 754.9389 766.1999 768.0944 779.4363 790.5538 801.3684 812.8618 831.5375 862.4928 880.8023 891.3776 911.5124 945.1412 948.7867 957.4207 959.5221 979.4411 982.4605 992.8912 1030.0221 1038.6530 1073.8428 1083.7767 1124.7055 1129.7956 1134.7280 1169.9358 1172.7964 1186.0582 1192.1778 1195.5888 1225.9253 1247.2769 1268.7037 1281.7176 1282.2931 1286.6924 1305.7216 1320.4120 1331.5752 1333.0277 1350.6947 1365.2034 1377.7784 1380.0953 1386.0209 1396.3094 1433.0261 1436.0774 1442.9533 1459.3913 1465.2185 1475.7910 1477.9610 1480.4015 1484.0288 1490.6424 1500.1211 1519.4483 1570.3950 1588.5307 1605.1685 1621.3612 2964.7436 2969.1046 2972.9280 2984.4871 3018.3893 3037.4425 3059.9765 3061.6917 3067.3990 3069.5987 3073.0313 3085.5780 3134.2304 3141.6787 3146.4742 3164.0007 3179.2569 3226.5798 3567.4462 3726.6852
redmass: 2.8781 5.7522 3.9643 6.4053 5.3276 5.5849 7.3210 2.1890 5.3056 6.9296 5.2334 5.4675 3.5740 4.2601 2.1115 1.6079 2.6432 1.2466 3.1497 5.2513 4.8081 3.1769 2.6313 2.4368 4.6248 5.5492 5.0164 1.2079 3.9059 3.3090 4.8633 1.0914 5.5984 4.6763 4.2372 6.3043 7.9921 5.2668 4.9375 5.2619 11.5322 4.8324 4.6808 3.0133 1.2591 1.4664 4.1693 3.5268 4.9394 2.0056 4.3421 1.4597 8.9088 1.6724 1.2022 1.3885 1.3411 2.3637 3.7732 1.9411 1.3202 1.9916 2.0738 2.2533 1.9311 2.3136 2.8222 2.2603 1.1622 1.0702 2.2865 1.9593 1.9029 1.9648 2.1898 1.4196 1.4735 1.4709 1.6078 2.8067 3.9706 2.2590 1.5042 1.8927 1.8838 1.4997 5.5776 1.2164 8.3949 1.2196 3.2209 1.6406 1.4105 1.1844 1.0461 1.1756 1.0644 2.7526 1.0757 1.0569 2.6326 8.1780 9.6347 6.5674 1.5137 7.5163 1.0773 1.0356 1.0368 1.0662 1.0597 1.1004 1.0997 1.0585 1.0994 1.0989 1.0993 1.1053 1.0868 1.1073 1.0906 1.0955 1.0993 1.0979 1.0440 1.1059
irintensity: 0.2270 0.7214 0.0251 0.5474 0.2262 1.1176 1.0250 0.0708 0.5650 0.1522 0.2044 6.6624 0.9348 2.8127 0.1943 0.2328 0.3715 0.3326 5.0647 2.9376 2.9382 8.2726 0.5145 2.1346 0.3130 4.9479 8.0625 285.9095 5.3909 2.4067 2.4016 1.1382 7.7564 2.9871 4.9465 14.1308 0.7692 10.4792 12.1551 8.2596 5.3156 26.6887 8.6027 25.9415 12.6359 62.8664 19.3429 5.4069 3.4493 4.7530 10.2048 0.4550 129.0168 5.7146 1.9950 2.9111 1.1134 2.4833 6.9159 2.1240 0.0204 8.6873 8.9200 7.3247 17.9371 5.4641 56.7965 16.8819 11.7922 0.3467 20.9100 14.7257 3.1697 63.3646 13.4790 17.4712 17.2342 7.2473 15.9182 9.8189 96.6570 5.5043 19.0613 14.6876 0.8873 31.9232 83.9869 17.8700 0.0602 15.3432 61.8512 21.9431 14.1895 17.6549 1.6269 20.2352 0.7127 47.2690 20.7659 24.8397 214.1288 331.5451 224.3166 12.9773 405.1498 4.1305 14.7143 34.7423 24.7988 24.5886 37.0290 11.1156 16.4223 5.0548 47.8338 68.5482 76.5350 15.9499 3.0801 1.1944 11.1592 17.8353 11.1813 0.1580 111.6198 43.8088
temp: 298.150 k
press: 1.00000 atm
elementType: 16 9 7 7 7 7 7 6 6 6 6 6 6 6 6 6 6 6 6 6 6 6 6 6 1 1 1 1 1 1 1 1 1 1 1 1 1 1 1 1 1 1 1 1
symmnumber: 1
zpe: 912026.1 jmol-1
zpe.correction: 0.347372 hartree
zpe.thermalcorrener: 0.369111 hartree
zpe.thermalcorrenthalpy: 0.370055 hartree
zpe.thermalcorrgfe: 0.294237 hartree
zpe.sumelectzpe: -1429.739942 hartree
zpe.sumelectthermal: -1429.718204 hartree
zpe.sumelectthermalent: -1429.717259 hartree
zpe.sumelectthermalfe: -1429.793077 hartree
dipole: -2.5436 2.4687 -1.5724
dipole: 3.8777
quadrupole: -105.7805 -142.2251 -149.3237
quadrupole: 1.4826 -7.1575 -1.0497
quadrupole: 26.6626 -9.7820 -16.8806 1.4826 -7.1575 -1.0497
hfenergy: -1430.0873141 hartree
pointgroup: C01 [X(C17H20F1N5S1)]
dipole: -1.0007065 1.039527 -0.4954504 debye
polarizability: 381.4720128|-5.1140237|216.93872|4.7742956|8.6731467|163.0025127 unknown
InChI: InChI=1S/C17H20FN5S/c1-11(2)7-8-23-10-20-14-15(23)21-17(19)22-16(14)24-9-12-5-3-4-6-13(12)18/h3-6,10-11H,7-9,19H2,1-2H3
charge 0 multiplicity 1
44 atoms
S  1.915104 -0.835232 -0.175993
F  4.646972 0.309941 2.375492
N  -3.11769 -0.901406 -0.561594
N  -1.15874 -2.110624 -0.495278
N  -2.200523 1.382307 -0.33488
N  0.25945 1.369559 -0.159838
N  -0.96076 3.366401 -0.121709
C  -5.15271 -0.484748 0.83872
C  -6.670133 -0.147883 0.880449
C  -4.560117 -0.597388 -0.586575
C  -7.541204 -1.256897 0.239544
C  -6.983534 1.236277 0.259364
C  -2.090744 0.030905 -0.416983
C  -0.881222 -0.734501 -0.380906
C  -2.496942 -2.166257 -0.596135
C  0.314915 0.016546 -0.242793
C  -0.977325 1.991337 -0.209812
C  3.071789 0.683874 0.001811
C  4.502338 0.21634 -0.045106
C  5.261656 0.0372 1.132933
C  5.16147 -0.062643 -1.27153
C  6.600099 -0.387785 1.14236
C  6.505143 -0.494315 -1.302608
C  7.22562 -0.657952 -0.095202
H  -4.590966 0.299712 1.381605
H  -4.976294 -1.439922 1.372679
H  -6.939251 -0.096128 1.956368
H  -5.062861 -1.392792 -1.164689
H  -4.683378 0.35515 -1.129875
H  -7.31734 -2.248305 0.676685
H  -8.615579 -1.051188 0.400001
H  -7.380696 -1.320506 -0.853563
H  -8.038542 1.51476 0.438267
H  -6.342985 2.025212 0.695436
H  -6.824869 1.237813 -0.83556
H  -3.074733 -3.082264 -0.704489
H  2.813145 1.16917 0.952653
H  2.819611 1.358597 -0.829618
H  4.600557 0.057424 -2.205373
H  -0.070548 3.843352 -0.015385
H  -1.838468 3.876645 -0.150996
H  7.126529 -0.502131 2.094345
H  6.988915 -0.703701 -2.262142
H  8.267845 -0.993154 -0.113382
