program: Gaussian 09
title: 000243137
version: EM64L-G09RevD.01
frameworkgroup: C1[X(C6H8N2O2S)]
method: RPBEPBE
basis: SDD
operation: Freq
keyword: #p
keyword: freq=noraman
keyword: PBEPBE/SDD
title: #p freq=noraman PBEPBE/SDD
converged: NO NO NO NO
title: Mulliken charges:
elementType: S O O N N C C C C C C H H H H H H H H
charge: 0.212842 -0.445924 -0.230884 -0.140691 0.047079 -0.221590 0.386700 -0.636445 -0.466644 0.035333 -0.795886 0.283100 0.257746 0.257766 0.241287 0.293834 0.238653 0.293851 0.389873
chargesum: 0.00000
title: Mulliken charges with hydrogens summed into heavy atoms:
elementType: S O O N N C C C C C C
charge: 0.212842 -0.056051 -0.230884 -0.140691 0.047079 -0.221590 0.386700 0.162167 -0.225357 0.035333 0.030452
polarizability: 1.35713179e+02 -5.75942214e+00 1.29793432e+02 6.65051121e-04 6.31449090e-03 4.92613728e+01
1716.lowfreq: -14.5825 -10.2488 -8.4407 -0.0018 0.0008 0.0017 57.0416 72.0709 99.2938
frequency: 56.4560 71.9777 99.2676 109.2156 155.7907 164.1777 194.1138 250.9364 272.2745 341.7459 363.0379 366.9673 395.7856 451.8719 546.8837 583.5829 605.6282 650.8433 675.0546 713.4047 739.8758 824.1478 851.7013 877.6013 990.8626 999.6005 1052.7318 1110.1588 1121.7092 1159.5359 1213.8035 1214.4338 1276.8768 1350.1638 1424.4478 1430.9083 1446.3799 1461.9283 1478.2360 1478.8219 1499.6792 1614.7530 1633.6358 3003.4683 3021.4678 3086.5945 3145.6968 3152.4381 3157.2748 3159.1824 3623.6681
redmass: 3.7488 2.5795 1.1962 1.0794 7.7521 3.9207 5.3821 4.2410 4.6346 7.9631 3.5570 1.1647 6.7066 8.5747 9.5099 5.7902 5.3365 11.2205 7.4406 3.2563 6.2495 1.7802 8.9922 4.2972 1.1812 1.2881 2.1241 1.7569 1.2941 3.9411 4.6800 1.9539 2.3195 1.1425 1.5227 1.0505 1.1316 1.8295 1.0405 1.5379 2.6025 9.9777 8.7634 1.0361 1.0292 1.1027 1.1034 1.0928 1.0982 1.1053 1.0661
irintensity: 5.1384 3.1562 1.1246 0.0042 0.1227 5.4498 3.9823 12.5143 3.9218 1.2511 11.5740 140.9777 22.9569 3.5425 0.3298 2.7666 5.2283 0.4843 3.2996 0.9593 8.3333 66.3671 42.0065 17.3994 6.7317 5.9972 157.8740 186.7345 0.7489 87.1737 26.2033 19.2384 200.8511 7.8887 55.0153 14.4232 11.0413 4.5337 21.7688 95.0030 247.6966 57.2688 763.8300 21.4716 17.3513 13.1660 5.6904 4.8849 0.9111 6.3815 64.1257
temp: 298.150 k
press: 1.00000 atm
elementType: 16 8 8 7 7 6 6 6 6 6 6 1 1 1 1 1 1 1 1
symmnumber: 1
zpe: 362892.0 jmol-1
zpe.correction: 0.138218 hartree
zpe.thermalcorrener: 0.149961 hartree
zpe.thermalcorrenthalpy: 0.150906 hartree
zpe.thermalcorrgfe: 0.099952 hartree
zpe.sumelectzpe: -890.606103 hartree
zpe.sumelectthermal: -890.594360 hartree
zpe.sumelectthermalent: -890.593416 hartree
zpe.sumelectthermalfe: -890.644369 hartree
dipole: -1.0610 -5.9612 -0.0034
dipole: 6.0548
quadrupole: -52.3781 -87.1155 -73.0593
quadrupole: 7.1508 0.0034 -0.0206
quadrupole: 18.4729 -16.2645 -2.2083 7.1508 0.0034 -0.0206
hfenergy: -890.7443213 hartree
pointgroup: C01 [X(C6H8N2O2S1)]
dipole: -0.3355178 2.3391742 -0.3006066 debye
dipolederiv: -0.7122763 -0.1231014 -0.0425335 -0.2927921 -0.1094718 -0.027956 -0.0228107 -0.0119881 -0.1121067 -0.8880169 0.6217985 -0.1161466 0.6046493 -0.7580772 0.0961285 -0.1140555 0.0977634 -0.4343717 -0.5434905 -0.1589004 0.0020883 -0.2696733 -1.3605793 0.0883646 0.0148745 0.0988966 -0.3810854 -1.2597491 -0.0789534 -0.1018414 0.0497756 -0.8586606 0.0949169 -0.1166268 0.0825572 -0.0982403 -1.0413454 -0.5193011 -0.01825 -0.7816527 -1.1703919 0.0367495 0.0120147 0.061726 -0.2178166 1.5407999 0.0179646 0.1418912 0.4274725 1.0487587 -0.0781691 0.0946416 -0.1169962 0.0384398 1.3648291 -0.0045585 0.1128058 -0.1605348 1.2775047 -0.1434902 0.1305876 -0.1291701 0.1872233 0.0131121 0.1414046 -0.0344113 0.1033077 0.4053425 -0.0137633 -0.0297938 -0.009814 0.2027444 -0.3340439 0.2236551 -0.0299379 0.1583717 -0.941411 0.0898852 -0.0221787 0.0960964 -0.3025294 1.217657 0.239928 0.064503 0.3912825 1.8482822 -0.1485148 0.0469351 -0.1626589 0.2585672 0.1873611 -0.0872095 0.0232245 -0.1083802 0.0873143 -0.0146021 0.0255221 -0.0125769 0.0535303 0.0423176 0.1164879 -0.0229963 0.0356808 0.0828068 0.0101846 -0.0136277 0.0178084 0.1382656 0.0529511 -0.0904544 0.108677 -0.02269 0.0270486 -0.0177222 0.0996936 0.0157834 -0.0123201 0.0859128 -0.1054769 -0.0672268 -0.0447179 0.0221534 -0.0013904 -0.0733254 -0.046735 -0.0401632 -0.0975007 -0.0036323 -0.0275729 0.0135332 0.0906433 0.0141119 -0.0295232 0.0123208 0.1978957 0.0822173 -0.0027176 0.0550458 0.0749924 0.0150285 0.078583 0.0340584 0.0436526 -0.0117337 -0.112435 -0.0192809 -0.0209868 -0.0504143 0.0755959 0.0016342 -0.0174018 0.0045974 0.129092 0.0972698 -0.0045546 -0.0359543 0.0809599 -0.0122232 -0.0654481 -0.0338915 -0.0460569 0.0004675 0.3044302 -0.1630975 0.0096223 -0.2091705 0.2303363 0.0004979 0.0149076 0.0047939 0.4041412 unknown
polarizability: 135.348896|6.4057844|128.4784316|7.3570618|-8.547642|50.9406559 unknown
InChI: InChI=1S/C6H8N2O2S/c1-8-5(10)3-4(9)7-6(8)11-2/h3,10H,1-2H3
charge 0 multiplicity 1
19 atoms
S  2.521971 0.937822 0.350543
O  -2.439659 1.735679 -0.206539
O  -0.908813 -2.836479 0.462625
N  -0.188024 1.217845 0.062814
N  0.621133 -1.038708 0.399235
C  0.821771 0.246826 0.269668
C  -1.495344 0.732993 -0.002828
C  0.123657 2.657695 -0.076239
C  -1.781884 -0.610568 0.125303
C  -0.713542 -1.595845 0.338306
C  3.449133 -0.662976 0.624508
H  -0.814213 3.205571 -0.228491
H  0.789243 2.820382 -0.941512
H  0.622675 3.028349 0.83577
H  -2.814908 -0.971746 0.070352
H  3.100554 -1.138085 1.551769
H  4.512901 -0.38124 0.693396
H  3.269652 -1.343249 -0.219305
H  -3.347103 1.349231 -0.246374
