program: Gaussian 09
title: 000243152
version: EM64L-G09RevD.01
frameworkgroup: C1[X(C19H24O)]
method: RPBEPBE
basis: SDD
operation: Freq
keyword: #pfreq=noraman
keyword: PBEPBE/SDD
title: #p freq=noraman PBEPBE/SDD
converged: YES YES NO NO
title: Mulliken charges:
elementType: O C C C C C C C C C C C C C C C C C C C H H H H H H H H H H H H H H H H H H H H H H H H
charge: -0.438792 -0.163571 0.269818 -0.111298 -0.176649 -0.529169 -0.486281 -0.563860 -0.506067 0.403274 -0.817780 0.250318 -0.409538 -0.584773 0.319983 -0.847001 -0.349857 -0.584062 -0.411915 0.293541 0.217857 0.240706 0.209161 0.209168 0.202955 0.220627 0.193567 0.215436 0.215082 0.218370 0.216298 0.234481 0.212583 0.228927 0.231937 0.221636 0.223310 0.223303 0.230214 0.230545 0.226910 0.222202 0.247835 0.350570
chargesum: 0.00000
title: Mulliken charges with hydrogens summed into heavy atoms:
elementType: O C C C C C C C C C C C C C C C C C C C
charge: -0.088222 0.054287 0.269818 0.129407 0.032512 -0.117045 -0.072086 -0.133342 -0.071399 0.403274 -0.141790 0.250318 -0.177601 -0.139828 0.319983 -0.162939 -0.122947 -0.361860 -0.164080 0.293541
polarizability: 2.63150040e+02 -1.34897028e+00 2.04554695e+02 8.35638405e+00 3.66165163e+00 1.29124048e+02
1716.lowfreq: -10.9818 -8.0615 -0.0005 0.0005 0.0007 4.4862 35.3943 60.2332 98.9042
frequency: 35.3589 60.2251 98.9032 116.8969 143.6141 161.0363 177.5601 205.0907 221.3260 225.4002 241.9865 251.7270 260.2687 290.0218 301.2802 334.8774 350.5948 354.2001 375.3767 398.4601 432.6350 440.6862 444.0531 474.2048 501.2550 510.8315 543.2085 559.6149 564.1054 590.2538 625.5126 659.8722 702.1912 711.9951 725.9382 780.2735 805.5514 818.3345 826.0622 840.0624 843.6819 864.4529 900.9755 911.6609 925.5142 929.1187 945.2173 951.6389 976.7656 991.1875 1009.9947 1015.9145 1021.9851 1040.9887 1051.8565 1068.9464 1093.2089 1102.6711 1103.8460 1117.1438 1133.3399 1138.2195 1158.2859 1164.1337 1172.2407 1175.8071 1195.0605 1210.7744 1216.5057 1230.5777 1242.6822 1252.0158 1259.6572 1270.6997 1286.6660 1289.4402 1292.8038 1302.5591 1315.9322 1325.6191 1330.1332 1337.4031 1342.6429 1354.3909 1376.6984 1381.8186 1383.9371 1394.7545 1425.4552 1454.6457 1456.1030 1461.0165 1464.8278 1468.3423 1469.6430 1472.0171 1482.2612 1490.9094 1499.0785 1601.0222 1618.6174 1649.5805 2901.1188 2919.2059 2948.4885 2954.3763 2958.1331 2960.8783 2962.3267 2973.3902 2978.5861 2984.4811 3013.2713 3016.8928 3027.7080 3028.5632 3034.8012 3039.4008 3065.3324 3074.2561 3082.1400 3089.8264 3139.7948 3142.8702 3170.8310 3580.4131
redmass: 4.2937 3.4878 3.6080 3.8845 1.7658 1.4375 1.9482 2.5323 1.7599 3.4223 3.1169 2.8186 2.1163 2.3017 2.7755 3.1057 1.1237 2.2012 2.8808 3.7640 3.5358 2.7973 3.6684 3.3917 3.3891 3.1451 3.2280 2.8185 3.0957 3.6535 3.1589 3.7769 3.0028 3.8192 3.8517 2.5721 1.3465 1.6092 1.4793 1.9291 2.0458 1.8520 2.3605 3.1758 1.8193 1.8393 1.7145 1.4344 1.9148 2.0298 1.8430 1.7079 1.9637 1.5985 2.6895 2.5936 1.7298 2.1597 2.1185 1.7203 1.5431 1.5425 1.5162 1.8860 1.5653 1.5487 1.6814 2.0697 1.8453 1.5331 1.4982 1.6708 2.0777 1.5517 1.3584 1.7169 1.4193 1.8865 1.3626 1.3447 1.5964 1.5843 1.4424 1.5391 1.7698 1.9078 1.7204 1.2569 3.3303 1.1249 1.0717 1.0528 1.0968 1.0710 1.0912 1.0836 1.0655 1.0599 2.6986 6.5604 6.6025 6.7685 1.0801 1.0800 1.0670 1.0640 1.0450 1.0524 1.0720 1.0729 1.0396 1.0594 1.0942 1.0990 1.0943 1.0962 1.1012 1.1021 1.0977 1.0978 1.0983 1.0906 1.0956 1.0873 1.0960 1.0659
irintensity: 0.1002 0.8218 0.0190 0.2623 0.8554 0.0124 0.4322 1.2666 0.0882 0.8567 0.1261 0.9334 0.3051 1.0608 1.4021 1.8791 141.5103 0.2915 0.1354 0.7394 3.6279 11.8596 6.5944 13.2075 2.6878 0.6741 0.4310 3.2240 3.7133 7.7071 2.5061 0.0680 4.9651 5.2376 1.9376 4.2581 17.0418 34.8400 0.6414 4.2826 12.8483 19.9365 20.7584 9.3123 5.3252 1.7507 3.3269 1.1987 5.9819 0.6025 2.7013 10.4686 5.4146 2.1356 2.2819 5.0395 0.5670 3.5943 8.4579 3.4241 117.9279 144.1829 4.9727 0.4510 9.5189 9.8510 9.6001 2.3346 2.5540 1.9229 2.6873 6.2800 18.4587 3.9455 0.8735 2.6953 6.1472 4.9100 1.2839 0.5589 3.9319 3.1684 1.5044 2.0083 7.0592 12.3262 13.3779 15.7445 43.2523 9.4123 9.9707 9.2463 7.1133 10.1782 5.3503 5.0575 15.6041 7.5282 78.2517 9.0244 64.9667 3.5884 12.9422 12.7575 37.0962 29.1245 6.6502 67.1220 19.4952 43.7212 23.2845 38.3048 38.9395 34.1057 49.1990 17.8915 36.4496 78.0872 33.8888 27.9123 39.4369 26.0389 32.8379 10.7724 11.6268 35.2733
temp: 298.150 k
press: 1.00000 atm
elementType: 8 6 6 6 6 6 6 6 6 6 6 6 6 6 6 6 6 6 6 6 1 1 1 1 1 1 1 1 1 1 1 1 1 1 1 1 1 1 1 1 1 1 1 1
symmnumber: 1
zpe: 996627.0 jmol-1
zpe.correction: 0.379595 hartree
zpe.thermalcorrener: 0.397505 hartree
zpe.thermalcorrenthalpy: 0.398450 hartree
zpe.thermalcorrgfe: 0.335461 hartree
zpe.sumelectzpe: -812.149133 hartree
zpe.sumelectthermal: -812.131223 hartree
zpe.sumelectthermalent: -812.130279 hartree
zpe.sumelectthermalfe: -812.193268 hartree
dipole: -0.9731 1.5586 0.2678
dipole: 1.8568
quadrupole: -121.9880 -113.4831 -123.2870
quadrupole: 12.9862 1.9215 2.0779
quadrupole: -2.4019 6.1029 -3.7010 12.9862 1.9215 2.0779
hfenergy: -812.5287285 hartree
pointgroup: C01 [X(C19H24O1)]
dipole: 0.3917507 -0.6070908 0.1079448 debye
polarizability: 263.1541907|-0.5569233|204.4872964|-8.4797981|-4.1668618|129.1872958 unknown
InChI: InChI=1S/C19H24O/c1-12-3-8-18-17-6-4-13-11-14(20)5-7-15(13)16(17)9-10-19(12,18)2/h3,5,7,11,16-18,20H,4,6,8-10H2,1-2H3
charge 0 multiplicity 1
44 atoms
O  -5.954737 0.283831 0.33968
C  1.990648 -0.733159 -0.326384
C  2.66888 0.55845 0.244052
C  0.511548 -0.836818 0.069234
C  -0.226368 0.393541 -0.554092
C  1.984192 1.775751 -0.422678
C  0.445465 1.750903 -0.181263
C  3.019208 -1.858944 -0.032962
C  -0.180652 -2.128414 -0.413012
C  4.146333 0.263875 -0.093215
C  2.575172 0.673108 1.799151
C  -1.736477 0.345748 -0.265757
C  4.330584 -1.085227 -0.19149
C  -1.615855 -2.204699 0.145831
C  -2.387941 -0.891082 0.020311
C  5.198765 1.339934 -0.16316
C  -2.536866 1.518081 -0.333907
C  -3.790075 -0.917829 0.223202
C  -3.929561 1.495413 -0.131074
C  -4.558334 0.263391 0.148765
H  2.016796 -0.608629 -1.433827
H  0.416091 -0.795999 1.175223
H  -0.10103 0.278437 -1.657003
H  2.184651 1.752193 -1.513834
H  2.394435 2.731595 -0.038568
H  0.221165 1.988754 0.876928
H  -0.006124 2.564037 -0.781167
H  2.934211 -2.712216 -0.731376
H  2.91511 -2.271728 0.994021
H  0.390899 -3.019623 -0.090022
H  -0.199243 -2.138778 -1.522328
H  2.944596 -0.246281 2.287836
H  3.200428 1.514566 2.153443
H  1.546106 0.857082 2.153081
H  5.300069 -1.574635 -0.339187
H  -1.564883 -2.48032 1.220531
H  -2.181959 -3.016642 -0.35123
H  5.248533 1.919434 0.780343
H  4.975327 2.068003 -0.967573
H  6.201076 0.918471 -0.355031
H  -2.065931 2.481435 -0.553458
H  -4.279732 -1.878648 0.440097
H  -4.534026 2.405344 -0.187132
H  -6.293699 -0.625804 0.5303
