program: Gaussian 09
title: 000020522
version: EM64L-G09RevD.01
frameworkgroup: C1[X(C15H16O3S)]
method: RPBEPBE
basis: SDD
operation: Freq
keyword: #p
keyword: freq=noraman
keyword: PBEPBE/SDD
title: #p freq=noraman PBEPBE/SDD
converged: YES YES NO NO
title: Mulliken charges:
elementType: S O O O C C C C C C C C C C C C C C C H H H H H H H H H H H H H H H H
charge: 0.975700 -0.395593 -0.502481 -0.519037 -0.553305 -0.271824 0.516813 -0.050496 -0.186712 -0.255175 0.453316 -0.371008 -0.429846 -0.359071 -0.382412 -0.247509 -0.222061 -0.799219 -0.256751 0.229708 0.216736 0.225674 0.243091 0.296415 0.290904 0.238227 0.233297 0.245664 0.246019 0.231908 0.223958 0.229779 0.232281 0.243307 0.229702
chargesum: 0.00000
title: Mulliken charges with hydrogens summed into heavy atoms:
elementType: S O O O C C C C C C C C C C C C C C C
charge: 0.975700 -0.395593 -0.502481 -0.519037 -0.106861 0.196940 0.516813 -0.050496 0.109703 0.035730 0.453316 -0.132780 -0.196549 -0.113407 -0.136393 -0.015600 0.001897 -0.093852 -0.027049
polarizability: 2.03914183e+02 2.27840479e+01 2.18134453e+02 -1.04571110e+01 6.95574554e+00 1.47137747e+02
1716.lowfreq: -18.3878 -0.0015 0.0008 0.0015 1.2017 4.5867 6.0936 24.9508 31.0191
frequency: -17.6065 24.6750 30.9367 44.1090 48.8033 53.6618 85.8723 129.0546 136.6253 162.2671 177.3260 232.0699 248.2607 257.0782 285.3582 304.4426 336.2697 363.3212 389.4726 402.8160 406.9660 409.7061 460.1154 479.6398 487.7469 520.0782 582.2516 591.6763 616.8667 620.7047 702.7766 704.4910 745.6867 760.1190 777.9653 822.7263 823.3908 830.5001 846.4084 856.2299 909.3873 952.3569 957.3804 964.6233 975.2097 977.5110 983.2040 987.7333 991.2152 993.6240 995.0006 1027.4288 1042.3879 1049.6905 1051.3990 1097.5098 1121.5801 1170.9858 1186.6638 1188.2033 1197.0257 1212.6571 1219.3893 1226.7032 1298.9584 1314.1174 1348.2447 1360.0025 1382.1294 1382.3701 1392.1862 1397.9961 1436.9574 1456.3619 1469.8338 1470.9918 1471.4353 1473.5022 1485.6532 1591.6412 1593.3936 1593.8764 1613.4853 2966.8161 2976.3194 2980.8354 3039.2072 3053.8464 3062.7829 3092.3573 3119.4054 3125.5946 3136.3363 3138.2324 3140.1573 3147.1456 3162.5897 3165.4246 3167.7664
redmass: 1.0213 4.6094 5.0255 4.2657 4.2292 5.3158 5.9448 5.5740 5.8660 4.2259 6.8158 8.3669 6.2685 3.8579 4.9748 2.9083 3.0181 3.8696 5.1482 2.8737 2.9434 4.0536 6.7663 3.8717 3.8505 4.2397 3.3896 6.1144 6.3851 6.9594 2.1903 3.0646 1.7858 2.5659 4.9481 2.8235 2.4500 2.5764 1.2442 1.2515 1.5051 6.3112 2.6790 1.3025 2.2548 1.4759 1.4433 1.7930 5.0574 2.7304 1.4117 2.1383 2.1762 1.5952 2.4736 1.6492 1.2921 1.0559 1.1337 1.1742 1.1670 2.2546 3.0850 1.1658 1.2597 1.3847 1.3678 1.2273 5.7597 6.0969 2.8558 1.2630 1.8623 1.2047 1.1014 1.1131 1.9937 1.1037 2.3063 5.9474 6.5986 6.2593 6.0851 1.0610 1.0621 1.0385 1.1018 1.0983 1.0954 1.0998 1.0851 1.0871 1.0919 1.0896 1.0897 1.0963 1.1010 1.0958 1.0972
irintensity: 0.6391 0.7480 0.5537 0.2519 0.5477 0.7521 1.0844 1.6716 4.2588 0.7530 0.2234 9.8855 1.3573 8.3317 2.5542 4.7848 4.0762 5.3727 14.3075 0.3785 0.5512 7.4594 60.1551 11.4879 3.6007 87.0089 41.5974 40.2287 0.2646 0.8649 33.2855 10.9220 73.2009 10.2869 4.1759 105.5639 6.4055 31.0262 2.1317 2.2159 5.8073 50.7389 53.6343 1.2923 42.0310 8.5270 0.7136 4.9614 0.5313 3.6097 2.5116 3.4737 9.6185 19.3470 16.6593 12.0990 5.8969 0.1678 7.3497 2.1734 1.9879 0.2693 4.8709 3.5990 2.0564 1.8694 0.6392 10.8476 2.1282 0.0070 13.7656 14.9072 5.0717 16.7835 16.2666 11.7475 24.1784 13.0625 13.5589 1.3146 8.1398 9.9418 5.0510 3.1011 65.3948 21.3120 28.7446 24.2611 16.9539 15.4419 2.5670 0.4262 17.5892 17.4051 4.5820 35.5906 13.7447 1.3784 15.2935
temp: 298.150 k
press: 1.00000 atm
elementType: 16 8 8 8 6 6 6 6 6 6 6 6 6 6 6 6 6 6 6 1 1 1 1 1 1 1 1 1 1 1 1 1 1 1 1
symmnumber: 1
zpe: 713245.2 jmol-1
zpe.correction: 0.271661 hartree
zpe.thermalcorrener: 0.289660 hartree
zpe.thermalcorrenthalpy: 0.290604 hartree
zpe.thermalcorrgfe: 0.223626 hartree
zpe.sumelectzpe: -1203.369266 hartree
zpe.sumelectthermal: -1203.351267 hartree
zpe.sumelectthermalent: -1203.350323 hartree
zpe.sumelectthermalfe: -1203.417301 hartree
dipole: 1.2156 5.1153 -1.4933
dipole: 5.4658
quadrupole: -101.0741 -123.9498 -121.3757
quadrupole: 12.1213 -0.7067 5.0503
quadrupole: 14.3924 -8.4833 -5.9092 12.1213 -0.7067 5.0503
hfenergy: -1203.6409271 hartree
pointgroup: C01 [X(C15H16O3S1)]
dipole: -0.2247047 -2.0496023 -0.6105924 debye
polarizability: 198.8555718|19.7130003|224.1129586|9.7193155|-5.0443558|146.2178526 unknown
InChI: InChI=1S/C15H16O3S/c1-13-7-9-15(10-8-13)19(16,17)18-12-11-14-5-3-2-4-6-14/h2-10H,11-12H2,1H3
charge 0 multiplicity 1
35 atoms
S  -0.669597 2.29116 0.489877
O  0.436192 2.129061 -1.03642
O  -1.640322 3.573564 0.317462
O  0.308601 2.179834 1.785105
C  2.747988 1.377769 -1.349963
C  1.846425 2.495646 -0.787138
C  2.621454 0.037187 -0.63729
C  -1.676079 0.729559 0.259553
C  -1.082912 -0.509241 0.553774
C  -2.995915 0.876486 -0.193729
C  -3.222038 -1.576873 -0.065911
C  2.815326 -0.072145 0.765192
C  2.321059 -1.139227 -1.369394
C  -1.876774 -1.663119 0.38509
C  -3.765427 -0.297218 -0.352316
C  2.717179 -1.323139 1.414298
C  2.223695 -2.394529 -0.72536
C  -4.065102 -2.829565 -0.214459
C  2.422531 -2.491513 0.671218
H  2.527955 1.254627 -2.42587
H  3.791841 1.75036 -1.279663
H  2.043681 3.458184 -1.295066
H  2.007122 2.622371 0.302846
H  -0.048449 -0.580764 0.902961
H  -3.402704 1.870035 -0.406555
H  3.036879 0.822095 1.359311
H  2.158249 -1.069428 -2.451675
H  -1.437849 -2.643539 0.602352
H  -4.799789 -0.214814 -0.704198
H  2.872639 -1.385855 2.49722
H  1.995809 -3.291733 -1.312251
H  -4.941637 -2.656434 -0.861575
H  -3.480089 -3.662223 -0.643481
H  -4.441139 -3.168565 0.770087
H  2.3564 -3.463213 1.173771
