program: Gaussian 09
title: 000243129
version: EM64L-G09RevD.01
frameworkgroup: C1[X(C11H8N4S2)]
method: RPBEPBE
basis: SDD
operation: Freq
keyword: #p
keyword: freq=noraman
keyword: PBEPBE/SDD
title: #p freq=noraman PBEPBE/SDD
converged: NO YES NO NO
title: Mulliken charges:
elementType: S S N N N N C C C C C C C C C C C H H H H H H H H
charge: 0.322905 0.526255 0.000686 0.040988 -0.348850 -0.334711 -0.803186 0.473174 -0.290900 0.128672 -0.373126 -0.374074 0.039173 -0.218815 -0.218796 -0.232226 -0.365880 0.299617 0.299341 0.238567 0.238409 0.231285 0.231332 0.233494 0.256666
chargesum: 0.00000
title: Mulliken charges with hydrogens summed into heavy atoms:
elementType: S S N N N N C C C C C C C C C C C
charge: 0.322905 0.526255 0.000686 0.040988 -0.348850 -0.334711 -0.204227 0.473174 -0.290900 0.128672 -0.134559 -0.135666 0.039173 0.012470 0.012536 0.001268 -0.109214
polarizability: 3.13779992e+02 -6.71644183e+00 1.61523138e+02 -5.91107901e-02 2.06703346e-01 1.12926076e+02
1716.lowfreq: -7.2403 -2.9359 -0.0015 0.0002 0.0019 2.4812 13.7957 25.6188 46.0887
frequency: 13.4918 25.0258 46.0871 67.6093 111.8828 122.8288 161.8193 191.8331 253.1908 261.1496 323.1115 393.7334 401.6079 426.8690 444.6598 472.3119 490.5064 555.0235 557.6452 566.8682 610.5100 613.7938 616.8211 645.2230 700.4252 702.5079 721.3279 775.6239 797.5079 803.5427 812.0995 852.4860 880.3954 928.4092 932.9373 941.8611 978.8895 990.0593 999.5717 1026.6031 1075.4270 1105.4220 1123.8233 1174.7311 1185.5289 1188.8125 1218.9153 1246.6586 1275.4676 1297.3996 1325.6496 1369.3375 1385.4283 1402.7262 1419.7293 1438.1322 1441.2539 1483.2361 1484.5529 1594.1126 1614.2898 3053.0189 3124.9291 3125.6647 3129.8591 3139.2301 3151.7867 3167.9877 3171.6089
redmass: 6.2833 4.2575 7.5454 5.3797 12.2233 6.9213 8.7919 12.4167 6.0601 7.1231 2.2114 14.9533 2.7968 11.2803 9.1330 4.5389 10.6581 6.4331 4.7774 11.2759 11.6230 9.2037 6.3320 5.4635 7.2722 1.8704 11.8993 2.1574 9.6869 11.7921 4.3411 1.2523 1.5421 1.4647 1.4563 9.7612 1.3918 6.2032 1.3249 2.1938 1.4896 8.4707 1.0818 1.0527 4.4463 1.1790 2.0355 1.5258 10.9176 6.7232 1.2795 1.9429 8.8368 6.4300 4.0301 1.1241 2.2033 7.2991 2.5441 6.0989 6.1425 1.0582 1.0857 1.0910 1.1056 1.0918 1.0963 1.1017 1.0924
irintensity: 0.1140 0.0855 0.0367 0.4207 0.8049 1.5765 1.7944 0.1636 2.3300 0.7818 0.8699 1.6970 0.0044 13.0740 4.7117 3.8418 1.6321 32.4145 16.8165 1.0384 0.9257 19.1273 0.1473 15.1832 4.6091 81.7473 43.3589 27.6462 24.0320 1.1695 9.9403 0.0110 0.3607 7.2675 9.5145 49.0327 0.0073 1.1930 0.0967 6.7948 8.1109 24.7162 2.0263 0.0210 41.9642 0.0385 0.0082 72.6855 31.6441 28.8125 0.2550 95.5461 0.3001 350.9790 20.5326 9.9481 9.2086 89.6236 17.2178 1.0915 1.3605 4.0043 7.3621 0.6506 2.6011 12.3815 35.0657 24.8643 14.2584
temp: 298.150 k
press: 1.00000 atm
elementType: 16 16 7 7 7 7 6 6 6 6 6 6 6 6 6 6 6 1 1 1 1 1 1 1 1
symmnumber: 1
zpe: 449392.6 jmol-1
zpe.correction: 0.171165 hartree
zpe.thermalcorrener: 0.185495 hartree
zpe.thermalcorrenthalpy: 0.186439 hartree
zpe.thermalcorrgfe: 0.126295 hartree
zpe.sumelectzpe: -1437.864555 hartree
zpe.sumelectthermal: -1437.850225 hartree
zpe.sumelectthermalent: -1437.849281 hartree
zpe.sumelectthermalfe: -1437.909424 hartree
dipole: 4.2938 -0.2905 -0.0001
dipole: 4.3036
quadrupole: -115.6589 -115.3057 -105.7592
quadrupole: 6.0910 0.0078 0.0586
quadrupole: -3.4176 -3.0644 6.4821 6.0910 0.0078 0.0586
hfenergy: -1438.0357199 hartree
pointgroup: C01 [X(C11H8N4S2)]
dipole: -1.6925747 -0.0239256 -0.0384277 debye
dipolederiv: -1.108189 -0.1110585 0.0151925 -0.4005388 -0.0076707 -0.0208963 0.1315822 -0.0129186 -0.0245393 -0.0515103 0.1787928 -0.0799721 0.3637233 0.0350934 0.0996291 -0.150828 0.092109 0.2186939 -0.9070245 -0.1837336 0.0531477 -0.9644608 -0.8533407 0.2607525 0.3647865 0.2819874 -0.2392094 -0.7228382 0.0454532 -0.031753 0.1977516 -0.467805 0.1102829 -0.0914694 0.1053421 -0.2507786 0.1593461 -0.3556125 0.1517956 -0.2732576 -0.0647746 -0.077324 0.1178079 -0.0772278 -0.2037983 -0.2046032 0.2769961 -0.1080316 -0.29591 0.0071755 -0.118932 0.1183019 -0.1020957 -0.2277803 0.8487237 -0.0772172 0.0520984 -0.275925 0.1470071 -0.0222161 0.1327015 -0.0159901 0.1177332 0.1636855 0.0143192 -0.000574 0.0757941 -0.0779393 0.0280532 -0.0241705 0.0264012 -0.0217426 1.588944 0.1008772 0.0009243 0.9878728 0.5437599 -0.1798584 -0.3557874 -0.2051014 0.0982308 -0.5269041 -0.0431481 -0.0006408 0.3214824 -0.3065646 0.1937175 -0.1451587 0.1845008 0.0789902 -0.1135667 0.0671125 0.0604159 0.0180989 -0.0859814 0.0736097 -0.0168725 0.0703937 0.0063269 -0.1101588 0.0063119 -0.0981212 0.0224597 -0.1150069 0.0372645 -0.0079646 0.041781 0.030491 -0.1378918 -0.0901493 0.0276045 -0.0494078 0.4049253 -0.0979045 0.0122011 -0.0994329 0.2054284 -0.0465224 -0.0009459 -0.109561 -0.0257651 -0.1185971 0.0403622 -0.1369664 0.0484827 0.0678491 -0.0586451 0.0691737 0.0749966 0.0683803 -0.0751965 0.0980864 0.1113082 0.0907028 0.0376849 0.0455695 0.0853999 -0.0302687 0.0667941 -0.1128343 0.0270586 -0.0223019 0.0277317 -0.059776 1.1587155 0.2232636 -0.0585642 0.268749 0.5923709 -0.2347644 -0.0780121 -0.235669 0.0786049 -0.0584846 -0.000482 0.0069124 0.1015251 0.0480624 0.024004 0.0152332 0.0355857 -0.0322634 -0.0576951 -0.0032277 -0.0083689 0.0651007 -0.018703 -0.0336446 -0.0848021 -0.0504014 0.0299551 0.0705291 -0.0726476 -0.0718326 -0.0699905 0.0832115 -0.0822424 -0.0772318 -0.0735113 -0.0022141 0.0590123 -0.0042103 0.1080577 0.0009264 0.1217742 -0.0288566 0.1101874 -0.0381857 -0.0295818 0.0184256 -0.0031949 0.0899239 -0.0067859 0.1345077 -0.0504958 0.1202551 -0.0497667 -0.0506278 0.0292169 -0.0596898 -0.0598535 -0.0827332 0.097315 -0.0929739 -0.079965 -0.0930281 -0.0240636 -0.1128706 -0.0787991 0.0243764 -0.0852659 0.1245459 -0.0162765 0.0268847 -0.0161389 0.0962725 0.0747362 0.0164163 -0.0079042 -0.0286177 -0.0353349 0.0635648 0.0102806 0.0644492 0.1001143 unknown
polarizability: 313.8850925|-0.7260717|154.3611313|5.9250814|-16.9089612|119.982982 unknown
InChI: InChI=1S/C11H8N4S2/c1-2-4-8(5-3-1)6-16-11-9-10(12-7-13-11)15-17-14-9/h1-5,7H,6H2
charge 0 multiplicity 1
25 atoms
S  -0.276587 -0.611926 0.263776
S  4.382827 -2.082931 0.97176
N  1.373513 1.438641 -0.514772
N  3.834758 1.479653 -0.468587
N  2.617642 -1.77618 0.806824
N  4.93007 -0.507925 0.358757
C  -1.461593 0.790526 -0.325444
C  -2.885721 0.317393 -0.185752
C  1.305211 0.192501 -0.018288
C  2.530276 -0.52532 0.300403
C  -3.603086 0.5359 1.019132
C  -3.532631 -0.348571 -1.259132
C  3.798441 0.191637 0.045793
C  -4.940584 0.101408 1.147228
C  -4.870242 -0.783309 -1.132957
C  -5.577674 -0.559342 0.071122
C  2.628619 2.014286 -0.713315
H  -1.17074 1.010451 -1.36359
H  -1.224343 1.663669 0.300763
H  -3.111774 1.047723 1.855335
H  -2.986122 -0.524277 -2.193503
H  -5.484837 0.278641 2.081236
H  -5.359681 -1.292905 -1.970063
H  -6.615794 -0.895235 0.169475
H  2.611552 3.029994 -1.118998
