program: Gaussian 09
title: 000243124
version: EM64L-G09RevD.01
frameworkgroup: C1[X(C18H15NO2)]
method: RPBEPBE
basis: SDD
operation: Freq
keyword: #p
keyword: freq=noraman
keyword: PBEPBE/SDD
title: #p freq=noraman PBEPBE/SDD
converged: YES YES NO NO
title: Mulliken charges:
elementType: O O N C C C C C C C C C C C C C C C C C C H H H H H H H H H H H H H H H
charge: -0.231246 -0.209464 -0.244739 0.342544 -0.327168 0.084647 0.222877 0.203826 0.333491 0.049340 -0.674709 -0.809639 0.109118 -0.362358 -0.415784 -0.414489 -0.366734 -0.229731 -0.253787 -0.212443 -0.222081 0.255442 0.232162 0.279903 0.240997 0.246762 0.232703 0.231505 0.229272 0.233379 0.260798 0.269945 0.221703 0.221745 0.234934 0.237277
chargesum: 0.00000
title: Mulliken charges with hydrogens summed into heavy atoms:
elementType: O O N C C C C C C C C C C C C C C C C C C
charge: -0.231246 -0.209464 -0.244739 0.342544 -0.071726 0.084647 0.222877 0.203826 0.333491 0.049340 0.078353 -0.098670 0.109118 -0.133086 -0.182405 -0.153691 -0.096788 -0.008027 -0.032043 0.022491 0.015196
polarizability: 2.99375896e+02 -1.39087601e+00 1.91729456e+02 -9.94019145e+00 2.47218783e+00 1.38771475e+02
1716.lowfreq: -6.7798 -0.0004 -0.0003 0.0006 5.6568 9.5377 27.3959 43.4215 53.0622
frequency: 27.2041 43.3928 53.0485 107.5897 118.6624 127.1309 138.6297 140.4689 157.5210 182.9810 210.1601 223.3488 254.5448 286.7998 300.2400 312.8453 349.7629 417.4962 437.2566 462.3031 503.3462 529.7918 545.5571 550.7739 561.1575 570.2612 586.9509 614.3719 654.3265 668.0271 686.3036 712.7348 739.0387 749.9175 759.1454 763.9696 788.6487 795.2635 823.4626 847.5955 853.7901 897.3215 907.3955 932.1485 968.7591 971.5423 973.4365 1004.0782 1010.6746 1012.6653 1019.5682 1038.9390 1063.8667 1089.8347 1110.1388 1118.5600 1134.5138 1163.0317 1169.8647 1181.8698 1204.5140 1211.2252 1241.7824 1255.1893 1280.9280 1294.5375 1334.2632 1371.8209 1398.2191 1403.2215 1405.8326 1419.8638 1439.0800 1449.5712 1461.5149 1464.3190 1475.5979 1478.6737 1479.8734 1488.8969 1494.7649 1573.9424 1582.4523 1604.4210 1619.1298 1625.5793 1693.5664 2973.7247 2975.0097 2994.7762 3050.5616 3068.1381 3098.5270 3104.7966 3124.3069 3132.4091 3133.9683 3146.2158 3146.6386 3157.5014 3163.0988 3171.3496
redmass: 4.4743 5.7317 4.7592 1.8909 1.3287 1.3664 4.0764 3.6600 3.3563 4.6474 5.8633 5.9813 2.7259 5.0828 3.4298 4.5369 4.8391 3.1784 3.1883 4.4005 7.2310 5.0529 5.1680 5.6786 5.7311 4.6425 4.6873 5.5440 4.8846 5.0876 6.7339 4.3527 4.8708 1.3773 3.6673 3.9013 1.6568 5.0529 9.7835 1.4899 2.8991 1.5363 2.8236 1.3755 3.3016 1.3033 1.7623 1.3338 3.7790 2.5226 2.1112 1.4748 1.9399 2.2140 1.7547 1.3073 1.4512 1.3141 1.1099 1.9400 2.3125 1.6029 1.6949 2.0332 1.4307 2.0972 2.0777 2.8345 5.7887 1.7322 2.3365 5.7083 1.5376 2.4383 2.3917 1.4599 1.6648 1.1497 1.6629 1.2262 1.2120 7.0445 6.7859 7.5739 7.3006 7.2858 12.9369 1.0413 1.0406 1.0827 1.0944 1.0949 1.0967 1.1005 1.0847 1.0887 1.0863 1.0951 1.0902 1.0955 1.1001 1.1003
irintensity: 1.7580 1.3359 0.9550 1.1585 0.4126 1.4104 3.0097 1.3447 2.9891 0.6456 1.0594 3.5158 0.1707 3.6647 4.7352 0.5267 2.9120 0.8387 5.5802 1.7483 9.6606 2.2785 6.5331 11.2975 3.5724 0.6792 0.3389 6.4569 4.3572 13.3925 0.7335 45.7402 15.6626 92.3293 4.3114 13.4239 39.9293 1.1214 187.8276 0.1310 35.2806 12.3328 10.3872 1.4890 148.9231 0.0505 62.6225 0.0727 0.3612 14.3460 3.5980 6.4826 3.4174 7.7813 6.2063 4.8522 8.4141 6.6850 7.1153 29.4645 6.3396 6.4943 2.8865 66.8669 5.3723 20.7576 8.1108 29.1352 47.7509 15.9338 37.4617 3.0740 0.9199 12.3733 5.4820 8.2403 34.8968 14.5755 24.9296 19.2839 19.5643 17.7458 7.9375 4.1532 18.5344 3.5569 415.2962 59.0466 41.9341 15.0687 19.4137 15.5463 19.6073 9.2165 0.8214 2.9876 1.1888 35.1196 7.4384 10.0788 36.2630 20.3333
temp: 298.150 k
press: 1.00000 atm
elementType: 8 8 7 6 6 6 6 6 6 6 6 6 6 6 6 6 6 6 6 6 6 1 1 1 1 1 1 1 1 1 1 1 1 1 1 1
symmnumber: 1
zpe: 739398.8 jmol-1
zpe.correction: 0.281622 hartree
zpe.thermalcorrener: 0.299191 hartree
zpe.thermalcorrenthalpy: 0.300135 hartree
zpe.thermalcorrgfe: 0.235660 hartree
zpe.sumelectzpe: -898.678419 hartree
zpe.sumelectthermal: -898.660851 hartree
zpe.sumelectthermalent: -898.659907 hartree
zpe.sumelectthermalfe: -898.724382 hartree
dipole: -0.3703 -2.9317 4.3315
dipole: 5.2435
quadrupole: -114.4214 -118.6133 -124.5291
quadrupole: -18.1315 6.1442 11.7227
quadrupole: 4.7665 0.5746 -5.3412 -18.1315 6.1442 11.7227
hfenergy: -898.9600416 hartree
pointgroup: C01 [X(C18H15N1O2)]
dipole: 0.1354891 1.9963202 0.5020698 debye
polarizability: 299.4062519|6.3139329|165.8657558|7.5744481|-26.5759841|164.6048189 unknown
InChI: InChI=1S/C18H15NO2/c1-11-12-7-5-6-10-15(12)19(2)16(11)17-13-8-3-4-9-14(13)18(20)21-17/h3-10,17H,1-2H3
charge 0 multiplicity 1
36 atoms
O  -1.309821 -1.749324 0.958938
O  -3.201969 -2.889956 0.184548
N  1.630292 -0.391674 1.307198
C  0.498572 -0.093807 0.501493
C  -0.865628 -0.285666 1.078902
C  0.924217 0.336498 -0.766626
C  2.783838 -0.124438 0.56757
C  2.372526 0.334327 -0.733948
C  -2.025031 0.486399 0.472854
C  -3.038637 -0.415785 0.088374
C  1.597669 -0.967522 2.655278
C  0.096983 0.718054 -1.969516
C  -2.611111 -1.81243 0.374512
C  4.147865 -0.250343 0.921037
C  3.362384 0.670654 -1.695806
C  -2.204318 1.873046 0.321075
C  -4.255585 0.026548 -0.46847
C  5.107279 0.090232 -0.05238
C  4.720133 0.546457 -1.348888
C  -3.423536 2.329322 -0.236225
C  -4.439803 1.417962 -0.629404
H  -0.83708 -0.111535 2.172511
H  1.465052 -0.194792 3.437168
H  0.78546 -1.709215 2.733218
H  2.547468 -1.492641 2.846012
H  -0.893401 0.236121 -1.970052
H  0.615246 0.411943 -2.896339
H  -0.066467 1.811689 -2.032747
H  4.460944 -0.591946 1.913479
H  3.074188 1.022128 -2.693084
H  -1.421491 2.580461 0.613753
H  -5.024256 -0.696844 -0.758984
H  6.172533 0.004864 0.19002
H  5.496051 0.801554 -2.079032
H  -3.586819 3.404706 -0.367852
H  -5.371948 1.801057 -1.057989
