program: Gaussian 09
title: 000243098
version: EM64L-G09RevD.01
frameworkgroup: C1[X(C12H13ClN2)]
method: RPBEPBE
basis: SDD
operation: Freq
keyword: #p
keyword: freq=noraman
keyword: PBEPBE/SDD
title: #p freq=noraman PBEPBE/SDD
converged: YES YES NO NO
title: Mulliken charges:
elementType: Cl N N C C C C C C C C C C C C H H H H H H H H H H H H H
charge: -0.088273 -0.471160 -0.005506 0.345892 -0.585270 -0.488051 -0.431157 -0.405685 -0.230761 0.580264 -0.348314 -0.324065 -0.220092 -0.246439 -0.257045 0.245225 0.253518 0.259388 0.224115 0.219720 0.238218 0.237734 0.216001 0.312509 0.254108 0.251919 0.229187 0.234021
chargesum: 0.00000
title: Mulliken charges with hydrogens summed into heavy atoms:
elementType: Cl N N C C C C C C C C C C C C
charge: -0.088273 -0.158651 -0.005506 0.345892 -0.086527 -0.004548 0.026781 0.048050 -0.230761 0.580264 -0.348314 -0.069957 0.031827 -0.017252 -0.023024
polarizability: 1.74646496e+02 -6.76035841e+00 1.57935522e+02 -1.13349612e+01 5.94663180e+00 1.00514798e+02
1716.lowfreq: -9.3822 -0.0025 -0.0023 -0.0023 7.7184 8.5156 39.0489 45.1516 56.7976
frequency: 38.4005 44.1208 56.0572 103.5461 114.2158 148.6488 151.8910 185.1720 227.4595 264.5397 303.7007 361.5524 391.0688 418.5131 439.1150 442.0035 487.3711 520.7174 542.4487 575.9547 619.6478 640.4231 679.2279 707.2085 738.0704 745.8374 795.7298 806.7410 837.2448 843.5205 891.7496 924.0598 943.7323 961.4175 969.5422 1002.7790 1025.9167 1033.9674 1038.7241 1053.8704 1088.4507 1103.4731 1135.0886 1173.9219 1194.8610 1198.1004 1226.2706 1233.0806 1259.8453 1284.7525 1305.2195 1313.2446 1326.0045 1330.9721 1368.7736 1432.4805 1453.9404 1463.0769 1473.0134 1477.3365 1491.0772 1508.8772 1572.2304 1619.4801 2177.1845 3008.6654 3014.5211 3017.4317 3029.0864 3058.0724 3077.3582 3086.9695 3098.4214 3138.3662 3155.0979 3167.8954 3178.5617 3527.8579
redmass: 4.6993 2.5103 3.2194 4.6094 5.6839 3.9535 4.6662 4.2987 6.0133 4.6880 3.3806 3.3892 7.2823 2.1542 1.9002 2.7965 6.6350 6.3929 3.7732 4.8457 3.4800 3.7861 5.3319 3.7407 2.0251 1.2671 1.8741 1.7116 1.4269 3.8172 2.5650 1.3623 1.8556 2.2138 1.3348 6.0574 4.2283 1.8818 2.2939 1.7419 2.3738 3.3343 1.5673 1.0854 1.3802 1.3663 1.1602 1.6532 1.6227 1.2827 1.3421 1.3602 1.5083 1.8199 4.5324 2.5687 1.6973 1.1214 1.0884 1.1912 1.1705 1.9521 4.7835 6.6933 12.6660 1.0589 1.0626 1.0607 1.0653 1.1031 1.1037 1.1026 1.1043 1.0861 1.0898 1.0940 1.1003 1.0765
irintensity: 1.1708 0.4019 1.6875 0.1002 2.2264 1.0272 1.4838 1.0486 4.8294 1.9012 1.0218 1.6564 5.9982 48.8992 21.4868 26.6360 0.6724 0.4406 0.4341 2.8424 0.6765 2.1944 22.1942 1.1963 24.6385 101.7098 0.5823 1.4453 2.2561 4.5918 3.2701 2.4532 1.8123 4.8579 0.0827 47.4206 4.1344 2.8362 3.9004 34.8268 4.1552 11.5098 3.4193 0.3653 1.2730 4.3402 1.7837 34.6831 11.4853 0.2261 5.6181 3.3731 28.5034 44.3160 71.7688 10.1239 5.8659 15.0747 12.5346 44.9533 53.8776 149.2281 1.8453 150.3575 5.4584 7.3469 30.3679 44.9457 22.8726 5.9988 2.2638 16.5052 71.3410 4.4947 8.8056 15.2490 8.6311 37.5137
temp: 298.150 k
press: 1.00000 atm
elementType: 17 7 7 6 6 6 6 6 6 6 6 6 6 6 6 1 1 1 1 1 1 1 1 1 1 1 1 1
symmnumber: 1
zpe: 585242.9 jmol-1
zpe.correction: 0.222907 hartree
zpe.thermalcorrener: 0.236968 hartree
zpe.thermalcorrenthalpy: 0.237912 hartree
zpe.thermalcorrgfe: 0.180844 hartree
zpe.sumelectzpe: -1033.531397 hartree
zpe.sumelectthermal: -1033.517337 hartree
zpe.sumelectthermalent: -1033.516393 hartree
zpe.sumelectthermalfe: -1033.573460 hartree
dipole: 1.2981 -2.1823 2.7080
dipole: 3.7123
quadrupole: -85.2105 -102.3525 -101.3944
quadrupole: -9.9894 2.6284 9.4916
quadrupole: 11.1087 -6.0334 -5.0753 -9.9894 2.6284 9.4916
hfenergy: -1033.7543046 hartree
pointgroup: C01 [X(C12H13Cl1N2)]
dipole: 0.7524615 -0.5005799 1.147322 debye
polarizability: 172.7210274|-8.2581869|155.2364257|-18.7149563|-8.522425|105.1393634 unknown
InChI: InChI=1S/C12H13ClN2/c13-10-5-1-2-6-11(10)15-12(9-14)7-3-4-8-12/h1-2,5-6,15H,3-4,7-8H2
charge 0 multiplicity 1
28 atoms
Cl -1.447422 -2.862431 0.19557
N  0.423261 -0.557357 -0.349211
N  1.31582 2.064998 -2.505091
C  1.625702 0.267613 -0.535245
C  2.8241 -0.685502 -0.853765
C  2.107811 0.93517 0.799215
C  3.243499 -1.268033 0.526586
C  2.750286 -0.234182 1.594616
C  1.444761 1.266127 -1.627721
C  -0.838517 -0.120982 0.058802
C  -1.85737 -1.072945 0.359199
C  -1.202291 1.253638 0.184656
C  -3.149543 -0.715789 0.765822
C  -2.497206 1.626847 0.598217
C  -3.478693 0.654577 0.894809
H  3.639896 -0.082354 -1.288099
H  2.548857 -1.452368 -1.599994
H  1.280611 1.419354 1.342518
H  2.854835 1.712145 0.552218
H  4.33682 -1.414174 0.567143
H  2.780351 -2.255364 0.699985
H  2.000756 -0.698158 2.258426
H  3.573854 0.129468 2.233236
H  0.52056 -1.559442 -0.524714
H  -0.479978 2.031638 -0.076548
H  -3.886386 -1.49548 0.980502
H  -2.741187 2.691746 0.676674
H  -4.48369 0.947137 1.212894
