program: Gaussian 09
title: 000243123
version: EM64L-G09RevD.01
frameworkgroup: C1[X(C19H17NO4)]
method: RPBEPBE
basis: SDD
operation: Freq
keyword: #p
keyword: freq=noraman
keyword: PBEPBE/SDD
title: #p freq=noraman PBEPBE/SDD
converged: YES YES NO NO
title: Mulliken charges:
elementType: O O O O N C C C C C C C C C C C C C C C C C C C H H H H H H H H H H H H H H H H H
charge: -0.227920 -0.293347 -0.245851 -0.279077 -0.479726 -0.354739 0.335448 0.323384 0.099570 0.183277 -0.037133 0.231506 0.140864 -0.446713 0.102243 -0.408662 -0.792672 -0.356790 0.186244 -0.327721 -0.256637 -0.219906 -0.538808 -0.496106 0.254660 0.304594 0.260493 0.225269 0.264967 0.268303 0.214081 0.230150 0.259350 0.221444 0.222730 0.305021 0.208964 0.228050 0.209220 0.228721 0.253254
chargesum: 0.00000
title: Mulliken charges with hydrogens summed into heavy atoms:
elementType: O O O O N C C C C C C C C C C C C C C C C C C C
charge: -0.227920 -0.293347 -0.245851 -0.279077 -0.175132 -0.100079 0.335448 0.323384 0.099570 0.183277 -0.037133 0.231506 0.140864 -0.186220 0.102243 -0.183393 -0.045320 -0.126640 0.186244 -0.068372 -0.035194 0.002824 0.203227 0.195089
polarizability: 3.44958462e+02 1.55911877e+01 1.83038038e+02 2.53501251e+01 -1.38003156e+00 1.76800180e+02
1716.lowfreq: -45.0507 -3.9033 -0.2168 -0.0004 -0.0002 -0.0001 5.2565 16.7505 34.3383
frequency: -44.6289 16.6551 34.2876 44.1081 53.7443 61.2846 100.6892 113.0210 128.7522 136.6302 148.5114 152.6778 178.4623 192.5781 207.0018 248.4903 261.6318 272.4187 299.3431 307.6788 325.4269 348.5935 373.7096 430.4229 434.4664 470.3025 484.8081 488.4563 514.1255 530.3484 550.2066 568.6683 577.0052 594.2932 603.9658 620.1984 656.0895 677.3140 695.0063 698.0876 740.1782 748.2305 763.2063 774.1673 795.6817 837.0626 845.1316 852.2592 853.6537 863.6495 901.3732 928.4443 932.2984 957.7379 964.3050 969.7376 996.6502 1013.3555 1027.4773 1036.1538 1044.4568 1106.2937 1111.2804 1119.4105 1147.5438 1150.3435 1156.9273 1162.5624 1177.9026 1193.7574 1223.0246 1231.4931 1243.3416 1251.0150 1270.5243 1293.0884 1311.9956 1360.3416 1371.9805 1400.0608 1403.4816 1413.5760 1423.9294 1433.7489 1443.7596 1449.5475 1452.5523 1459.2766 1467.2051 1468.5736 1473.1623 1483.2577 1484.7135 1495.3369 1570.3380 1589.7262 1591.8625 1595.6396 1632.9179 1662.9679 2976.0385 2983.1871 2983.4365 3005.9260 3065.8327 3085.1994 3090.7718 3093.7177 3123.2550 3127.3345 3128.4773 3130.7576 3144.8522 3150.1381 3163.7686 3171.7196 3597.3282
redmass: 1.0905 5.1306 3.9494 4.1049 3.8377 2.6276 2.7922 3.4959 3.2604 4.1372 1.9390 3.3226 2.1527 2.3516 4.7252 3.3528 4.5478 4.2305 4.3200 4.4186 5.0096 5.1158 6.2387 2.9598 6.6012 5.8512 4.8278 5.0902 5.5217 5.8039 1.1952 4.8125 3.4273 7.0647 5.3639 6.2766 5.8113 5.4636 7.3845 5.6928 5.0150 1.4090 4.0468 6.2179 4.4981 1.6778 2.0789 4.1027 3.8540 6.0968 6.6497 1.3940 4.0531 1.3829 7.6481 1.3087 1.8245 2.0980 3.1704 1.7001 3.1990 1.2361 1.8498 1.2419 1.3571 1.4991 1.4024 1.3121 1.8874 2.4415 1.9152 1.7808 1.7605 2.0825 3.2238 1.7567 2.5967 2.0955 5.3369 3.4800 1.6403 2.5459 1.4065 2.4578 1.3730 1.0630 1.0939 1.0728 1.7196 2.3388 1.7221 2.3502 1.3288 1.0603 7.1365 7.3033 6.2639 8.2313 6.9023 11.5478 1.0326 1.0337 1.0374 1.0838 1.0977 1.0986 1.1005 1.0984 1.0853 1.1056 1.1053 1.0888 1.0949 1.0886 1.1001 1.0969 1.0804
irintensity: 0.3166 0.5500 1.4423 1.7087 1.6196 1.8607 12.1197 0.2102 2.5907 1.2413 1.8744 1.5906 1.3999 1.3370 0.4546 13.4696 2.6690 1.0244 2.0282 0.8913 2.0512 5.7255 9.5506 6.7022 1.3980 8.1403 1.1691 3.9452 5.7628 18.6892 75.6087 6.0264 5.7702 10.5292 2.8330 11.8187 17.4490 8.2227 1.8521 22.8322 26.5801 84.5504 3.4596 7.8906 32.8371 28.5102 22.4819 40.7085 48.7860 79.7416 6.4950 2.9219 21.4047 2.0667 216.5818 0.8037 5.7224 9.5625 22.8104 17.7188 31.9802 1.0136 1.3927 14.1501 0.2622 13.7130 2.8411 7.4649 11.5191 53.1120 89.1829 14.3321 2.7240 90.1717 233.5623 5.3903 18.2857 7.5519 108.2651 0.3271 5.6750 40.2160 17.2603 82.2014 14.3633 24.5691 35.1270 12.7836 198.8837 8.4930 79.4527 2.2981 7.9761 43.5892 29.0261 9.9932 7.0075 12.0139 7.5379 390.1292 77.7852 94.2410 27.5720 9.0919 10.1050 17.0041 29.4978 49.6205 5.8537 19.4805 5.7629 3.0742 35.8249 4.7272 32.4031 5.2250 51.3006
temp: 298.150 k
press: 1.00000 atm
elementType: 8 8 8 8 7 6 6 6 6 6 6 6 6 6 6 6 6 6 6 6 6 6 6 6 1 1 1 1 1 1 1 1 1 1 1 1 1 1 1 1 1
symmnumber: 1
zpe: 829878.6 jmol-1
zpe.correction: 0.316084 hartree
zpe.thermalcorrener: 0.337114 hartree
zpe.thermalcorrenthalpy: 0.338058 hartree
zpe.thermalcorrgfe: 0.264891 hartree
zpe.sumelectzpe: -1088.157564 hartree
zpe.sumelectthermal: -1088.136534 hartree
zpe.sumelectthermalent: -1088.135590 hartree
zpe.sumelectthermalfe: -1088.208756 hartree
dipole: 0.2848 -3.6016 0.3085
dipole: 3.6260
quadrupole: -113.9589 -155.0870 -124.3468
quadrupole: 5.0443 -15.7457 -3.4788
quadrupole: 17.1720 -23.9561 6.7841 5.0443 -15.7457 -3.4788
hfenergy: -1088.4736476 hartree
pointgroup: C01 [X(C19H17N1O4)]
dipole: -0.0124619 -1.1712645 -0.8143391 debye
polarizability: 345.0913639|-18.3869001|178.1704094|22.9129872|3.0799042|181.534906 unknown
InChI: InChI=1S/C19H17NO4/c1-10-15(11-6-4-5-7-13(11)20-10)17-12-8-9-14(22-2)18(23-3)16(12)19(21)24-17/h4-9,17,20H,1-3H3
charge 0 multiplicity 1
41 atoms
O  -0.035992 1.501217 1.157596
O  -4.256668 0.543105 -0.282545
O  -2.065016 2.610454 1.046432
O  -4.226983 -2.063763 -1.49407
N  3.218664 0.728356 -1.728303
C  0.533015 0.135869 0.786785
C  1.775299 0.265371 -0.034963
C  -0.661404 -0.561965 0.155405
C  3.120029 -0.064999 0.407076
C  1.870647 0.753483 -1.348612
C  -1.819104 0.247898 0.25799
C  4.00981 0.229737 -0.683987
C  -1.416517 1.561293 0.845335
C  -0.694137 -1.814282 -0.475756
C  -3.072718 -0.194779 -0.258044
C  3.665223 -0.584026 1.611202
C  0.815528 1.298197 -2.269784
C  5.402723 0.019009 -0.609577
C  -3.107533 -1.483289 -0.889796
C  -1.925296 -2.260058 -0.997377
C  5.055548 -0.794982 1.69523
C  5.916229 -0.498899 0.597433
C  -4.718266 1.232468 0.94868
C  -5.590377 -1.805479 -0.990986
H  0.786894 -0.331888 1.757363
H  3.564625 1.040985 -2.633722
H  0.209217 -2.424277 -0.569234
H  3.022539 -0.811629 2.469613
H  -0.060482 0.62846 -2.31274
H  0.45652 2.285021 -1.922785
H  1.19752 1.420399 -3.299093
H  6.066129 0.248871 -1.45087
H  -2.01584 -3.231834 -1.492493
H  5.488337 -1.190722 2.62069
H  6.993236 -0.673943 0.695212
H  -4.084805 2.108314 1.157029
H  -4.704435 0.529977 1.803909
H  -5.752625 1.53444 0.724049
H  -5.630853 -1.89317 0.110989
H  -6.201586 -2.59753 -1.451679
H  -5.943097 -0.808813 -1.295804
