program: Gaussian 09
title: 000243030
version: EM64L-G09RevD.01
frameworkgroup: C1[X(C7H15N3O)]
method: RPBEPBE
basis: SDD
operation: Freq
keyword: #p
keyword: freq=noraman
keyword: PBEPBE/SDD
title: #p freq=noraman PBEPBE/SDD
converged: YES YES NO NO
title: Mulliken charges:
elementType: O N N N C C C C C C C H H H H H H H H H H H H H H H
charge: -0.309349 -0.293884 -0.387360 -0.639499 -0.058741 -0.430011 -0.392642 -0.393145 -0.400334 -0.387037 0.266648 0.206993 0.186873 0.219645 0.209045 0.207138 0.198205 0.191522 0.185634 0.199340 0.196715 0.191621 0.284836 0.303650 0.338317 0.305818
chargesum: 0.00000
title: Mulliken charges with hydrogens summed into heavy atoms:
elementType: O N N N C C C C C C C
charge: -0.309349 -0.009048 -0.083710 0.004637 0.148252 -0.023493 0.023541 -0.003417 -0.015360 0.001299 0.266648
polarizability: 1.21385900e+02 6.23180081e+00 8.65228517e+01 -4.96985364e+00 3.05619791e+00 8.57911042e+01
1716.lowfreq: -22.6416 -0.0007 -0.0006 -0.0004 0.8137 15.4800 40.0917 73.4163 77.4310
frequency: 39.7389 73.3737 77.2962 142.0094 207.8996 220.3177 254.9426 301.9752 318.6378 340.1033 420.0284 431.4349 445.0191 466.3082 492.3893 511.9366 552.5197 668.1291 682.9513 714.9471 780.6542 796.4154 842.1139 879.1560 892.6895 919.4149 937.3811 960.7566 1035.3450 1044.3126 1049.0091 1075.2859 1087.2717 1111.1933 1145.9821 1171.4584 1191.2667 1246.1185 1252.6523 1256.0598 1291.4996 1305.3208 1321.1978 1331.8882 1337.7966 1338.6071 1341.4544 1358.2798 1439.7679 1456.0823 1461.8298 1463.4405 1468.8441 1476.4455 1496.5553 1594.9713 1646.2985 2956.2616 2960.4556 2966.4176 2967.1480 2975.2764 2985.9563 3026.9365 3027.5317 3036.8189 3042.7875 3052.8109 3367.2359 3525.1092 3542.2729 3697.1131
redmass: 3.5872 4.0266 5.3139 2.9645 2.2445 2.7080 3.1184 2.9954 1.7373 1.3380 2.3265 2.7213 2.0070 1.2634 1.2386 2.3682 2.7898 4.8373 2.2399 3.7531 1.4793 2.1189 2.0146 1.8860 1.4497 1.9852 2.8625 2.0539 2.1540 1.7692 1.1098 1.4051 2.7786 2.5087 3.1400 3.0713 1.5886 1.3115 1.3294 1.3183 1.2524 1.3030 1.7256 1.3731 1.4886 1.5027 1.4657 1.4807 1.9224 1.1003 1.0909 1.0901 1.0825 1.0963 1.1728 1.3324 3.5087 1.0673 1.0638 1.0623 1.0633 1.0782 1.0648 1.0958 1.0972 1.1000 1.0998 1.1022 1.0730 1.0762 1.0469 1.1040
irintensity: 2.6362 5.3330 9.6386 5.3397 2.2214 0.6639 20.6098 5.7729 10.8507 36.0835 24.7279 9.7489 22.7259 344.8175 19.6730 10.8273 16.7562 15.6253 31.9704 81.5264 1.5328 14.6493 4.5430 8.4995 13.4966 1.6733 9.1213 8.7909 4.8768 0.7080 0.4565 1.9765 5.3849 0.2114 4.7570 4.6751 0.8145 1.1609 4.1427 4.6634 6.4841 9.1543 133.7744 2.9622 2.0449 4.8671 2.8090 6.2679 249.9960 21.9618 3.9992 10.7365 24.9603 2.1456 21.2869 90.5458 251.6352 29.7623 20.7754 32.9208 34.9045 27.3575 36.2310 73.7174 70.3004 36.9729 41.1019 84.8733 3.0277 22.6698 31.1869 36.3163
temp: 298.150 k
press: 1.00000 atm
elementType: 8 7 7 7 6 6 6 6 6 6 6 1 1 1 1 1 1 1 1 1 1 1 1 1 1 1
symmnumber: 1
zpe: 593927.4 jmol-1
zpe.correction: 0.226215 hartree
zpe.thermalcorrener: 0.237826 hartree
zpe.thermalcorrenthalpy: 0.238770 hartree
zpe.thermalcorrgfe: 0.188541 hartree
zpe.sumelectzpe: -514.327091 hartree
zpe.sumelectthermal: -514.315480 hartree
zpe.sumelectthermalent: -514.314536 hartree
zpe.sumelectthermalfe: -514.364766 hartree
dipole: 1.1448 -0.2554 -3.2514
dipole: 3.4565
quadrupole: -54.3015 -69.8510 -67.0500
quadrupole: 0.5327 -11.1276 -1.0970
quadrupole: 9.4327 -6.1169 -3.3158 0.5327 -11.1276 -1.0970
hfenergy: -514.5533064 hartree
pointgroup: C01 [X(C7H15N3O1)]
dipole: -0.3008601 0.3284372 -1.2848647 debye
dipolederiv: -0.5793475 -0.0545918 -0.1241352 -0.1442291 -0.6931941 0.2261356 -0.1154574 0.2709531 -0.8648747 -0.180233 0.1641373 0.0717784 0.2127998 -0.4636157 -0.0606133 0.0539058 0.0331165 -0.0380078 -0.6451253 -0.3126203 0.1694976 -0.5860729 -0.6072057 -0.0552523 0.4789184 0.2072702 -0.3084338 -1.1985601 -0.0866678 -0.3338032 -0.0858587 -0.586442 -0.3158076 -0.382116 -0.3323942 -0.6480069 0.5189518 -0.0415095 -0.028412 -0.0342111 0.316465 -0.0221918 -0.1010009 -0.0973467 0.1754971 -0.0932135 -0.0263512 -0.0250089 0.0338079 0.0813597 -0.0614467 -0.0193464 -0.0155921 0.1297881 -0.1168847 0.0229493 -0.0046763 0.0923123 -0.0627868 -0.0226614 0.000662 -0.0246923 0.0888519 0.1003501 0.0268766 0.0051091 0.002968 0.0641251 -0.0217564 -0.0525141 -0.0499264 0.1395298 0.0712536 -0.0139137 -0.0196754 0.0478232 0.0963819 -0.0517154 -0.0350692 -0.0251648 0.1454484 0.0620686 0.0107113 -0.036205 -0.0049571 0.0510416 -0.0368054 0.0050924 -0.0396085 0.1232153 1.2400548 0.5437567 0.5005292 0.8500911 1.2647267 -0.1453216 0.3974975 -0.2716432 1.1763167 0.0082426 -0.0064864 0.0343638 0.0054274 -0.0105501 0.0629795 0.0494289 0.0811606 -0.1388269 0.0187031 -0.0261536 0.0565356 -0.0510671 0.0397708 0.1162088 0.0515328 0.0456553 -0.1356763 0.0450649 0.0846675 0.0091514 0.0626818 -0.1791192 -0.0391832 0.0006447 -0.0078284 0.0680325 -0.014117 -0.079877 -0.0932766 -0.0814873 -0.015254 -0.0722517 -0.1148456 -0.0941035 -0.0449697 0.0584043 0.0064178 0.0503134 0.0093283 0.0294906 0.0387135 0.0744278 0.0841721 -0.093486 -0.0715034 -0.0863367 -0.0993521 -0.0756509 -0.0280726 -0.0954048 -0.1253118 -0.125377 -0.0525645 0.0275416 0.0076647 0.0373892 0.0003559 -0.0013848 0.0783045 0.0976518 0.1331018 -0.1282774 0.0085226 -0.0190603 0.0211262 -0.0587236 0.0429099 0.1174806 0.0521525 0.0493532 -0.1678505 -0.011303 0.0609391 0.0003388 0.0958212 -0.208044 -0.0473817 -0.0048824 -0.0177707 0.067068 -0.2535933 0.040454 0.0195917 0.0306361 0.039732 -0.01679 0.0537362 -0.0221796 0.0634306 0.08563 -0.0385313 0.058256 -0.0089585 -0.0157576 0.0724638 -0.0089943 0.0845207 -0.1578608 0.1200602 -0.0338447 -0.0472353 -0.0527976 0.2398464 0.1700831 -0.0228503 0.0309146 0.0780268 0.1665262 0.015732 -0.1451781 -0.0746983 0.1256175 0.0525283 -0.1970508 -0.0259001 0.1857651 0.3108506 -0.0745867 -0.057978 -0.0671351 0.2509532 0.0610623 -0.0732015 0.0534099 0.1989116 0.3216557 -0.0837754 -0.0190442 -0.1182058 0.2290061 0.0686231 -0.0630102 0.0758996 0.1389533 unknown
polarizability: 114.1171514|11.3376328|91.6398707|12.4947329|1.1729736|87.9428341 unknown
InChI: InChI=1S/C7H15N3O/c8-7(11)10-9-6-4-2-1-3-5-6/h6,9-10H,1-5,8H2
charge 0 multiplicity 1
26 atoms
O  -2.238318 -1.389499 0.57008
N  -0.91758 1.049128 0.07564
N  -1.846352 0.450281 -0.832144
N  -3.447509 -1.172553 -1.424062
C  0.521326 0.765253 -0.241572
C  1.377687 1.524844 0.797143
C  0.905943 -0.736466 -0.284003
C  2.890026 1.343055 0.522771
C  2.416554 -0.911259 -0.576049
C  3.280311 -0.153271 0.460451
C  -2.49177 -0.752541 -0.498676
H  0.71303 1.204722 -1.242205
H  1.143752 1.133599 1.81073
H  1.099435 2.595263 0.787656
H  0.301462 -1.255657 -1.051351
H  0.649892 -1.200442 0.689264
H  3.477752 1.862482 1.304268
H  3.14577 1.826513 -0.443091
H  2.642712 -0.522382 -1.591564
H  2.677984 -1.987158 -0.58141
H  4.355475 -0.257186 0.215661
H  3.131867 -0.611198 1.460356
H  -1.15015 0.714486 1.027975
H  -2.308943 1.11639 -1.453846
H  -3.972004 -2.012866 -1.195055
H  -3.528954 -0.775035 -2.357468
