program: Gaussian 09
title: 000243046
version: EM64L-G09RevD.01
frameworkgroup: C1[X(C19H26O)]
method: RPBEPBE
basis: SDD
operation: Freq
keyword: #pfreq=noraman
keyword: PBEPBE/SDD
title: #p freq=noraman PBEPBE/SDD
converged: NO YES NO NO
title: Mulliken charges:
elementType: O C C C C C C C C C C C C C C C C C C C H H H H H H H H H H H H H H H H H H H H H H H H H H
charge: -0.439800 0.357421 -0.180865 -0.088225 -0.043666 -0.216746 -0.500352 -0.497094 -0.499564 -0.525076 -0.499739 -0.789188 0.318366 -0.792055 -0.579182 0.332172 -0.396986 -0.548183 -0.430233 0.284475 0.204081 0.196334 0.202190 0.209889 0.206762 0.209274 0.220818 0.210802 0.209400 0.212362 0.221295 0.215758 0.216489 0.201674 0.212379 0.219283 0.207664 0.225906 0.213391 0.215269 0.224433 0.222365 0.233196 0.255478 0.216833 0.351194
chargesum: 0.00000
title: Mulliken charges with hydrogens summed into heavy atoms:
elementType: O C C C C C C C C C C C C C C C C C C C
charge: -0.088606 0.357421 0.023216 0.108108 0.158524 -0.006857 -0.084316 -0.065473 -0.077802 -0.088023 -0.081576 -0.149862 0.318366 -0.137489 -0.132384 0.332172 -0.163790 -0.292705 -0.213400 0.284475
polarizability: 2.65111223e+02 2.73463801e+00 1.87227744e+02 2.82799678e+00 -3.42069116e+00 1.46034460e+02
1716.lowfreq: -21.2486 -8.9143 -8.1048 -0.0006 -0.0005 0.0005 41.5627 67.0350 80.0169
frequency: 41.1177 67.0125 80.0131 111.7300 152.3103 154.8125 169.8695 208.5703 209.6921 220.9940 227.5210 247.9668 264.2907 273.0681 297.7667 327.2777 337.8726 359.9152 378.6134 405.4682 409.9683 444.5336 447.5076 460.8048 490.9618 514.8065 546.3888 562.2821 589.8573 594.5327 611.8690 653.4186 679.8724 714.5529 719.4145 782.9771 789.9845 803.9169 819.3182 837.6314 856.0750 868.8224 885.2306 899.0947 911.0723 926.1798 928.6723 952.2766 961.3190 977.7003 992.2208 1008.6192 1025.4001 1028.3020 1040.5879 1052.8819 1067.3486 1080.0078 1105.8867 1115.0061 1122.8864 1128.2188 1144.3115 1146.9739 1154.1192 1172.1485 1179.0338 1197.8063 1199.6885 1214.8836 1222.3484 1227.6958 1238.6366 1254.0924 1265.8250 1269.6908 1274.1407 1277.4675 1295.8780 1305.1792 1315.2470 1322.9080 1325.8520 1332.0623 1334.0678 1339.6130 1344.4573 1364.2356 1370.4074 1381.5153 1388.5694 1390.1912 1445.2995 1456.3218 1457.7409 1465.9168 1468.0431 1470.1418 1476.9793 1479.0182 1484.0284 1488.4957 1490.1461 1492.8020 1588.8549 1630.2707 2929.7905 2938.2803 2946.7820 2949.1457 2955.6796 2961.0795 2970.9745 2972.2677 2981.5675 2983.7252 2987.4910 2999.2826 3019.5433 3020.3394 3033.3871 3037.5422 3046.0603 3055.4449 3058.8363 3060.1828 3067.8570 3078.4158 3104.4972 3128.1003 3142.6600 3583.0382
redmass: 4.1861 3.7074 3.1232 2.0813 3.2689 3.3397 2.7948 1.7268 1.1449 2.3293 1.8707 2.8928 2.8198 2.1651 2.5317 3.1737 1.1191 2.1961 3.8119 3.7674 2.7664 2.9790 2.6850 3.5517 3.8353 3.3429 2.8643 2.8628 4.0290 3.6871 2.7573 2.9627 3.1090 3.3679 4.5590 1.8697 1.6439 1.8202 1.8591 2.4601 1.7409 2.0328 1.7093 2.1883 1.8968 1.4358 2.1019 2.0616 1.7373 1.8577 2.1204 1.8224 1.9964 2.8671 1.9104 1.8534 1.8661 1.6303 2.0178 2.0910 1.8973 2.0398 1.5433 1.5156 2.1673 1.5171 1.4398 1.8079 1.7705 1.8002 1.3806 1.3317 1.7100 1.5561 2.1431 1.4763 1.4128 1.2984 1.3386 1.3179 1.3263 1.3602 1.4601 1.4996 1.5004 1.4991 1.5280 1.4913 1.5006 1.2492 4.5711 1.2484 2.8254 1.1781 1.0777 1.0899 1.0744 1.0730 1.0534 1.0598 1.0797 1.0766 1.0698 2.7227 7.1418 6.5145 1.0813 1.0835 1.0832 1.0834 1.0648 1.0601 1.0368 1.0373 1.0606 1.0617 1.0618 1.0629 1.0970 1.0949 1.1011 1.1021 1.1016 1.0985 1.1026 1.0982 1.0989 1.0961 1.0864 1.0965 1.0919 1.0659
irintensity: 0.0262 0.1793 0.3332 0.0713 0.1526 0.3349 2.3103 0.0914 0.0331 4.2877 1.3017 0.9964 1.1127 0.0507 0.2589 3.7262 137.7672 0.0420 2.3865 5.1447 0.3651 3.8527 1.4921 2.0932 2.3670 2.3561 3.6044 6.2418 6.7055 0.9407 2.2585 1.5791 0.1043 2.0588 0.8049 22.0609 3.4162 17.9261 2.0392 3.2999 8.9509 4.0561 12.6298 46.4474 4.0586 1.1397 9.0527 1.8324 0.6835 1.5267 3.7293 12.5751 3.7629 0.3965 3.9417 7.6100 9.6294 2.2032 20.7196 24.0371 42.0008 0.7768 62.7805 22.8724 11.3705 32.8041 15.6094 4.1300 7.1996 2.4802 0.2410 1.1860 14.1236 6.6530 37.0903 2.2235 10.1584 2.0059 0.3913 0.9171 2.3043 0.2524 4.6783 2.3957 1.9152 2.3751 0.5754 1.0167 4.1983 16.7961 18.2079 14.9368 6.9238 5.8704 1.8642 8.3041 7.7035 2.1739 12.1354 1.5151 12.8742 10.9612 11.5423 98.3173 24.2331 53.5938 21.1707 4.7459 54.6550 33.2200 27.8189 31.9144 18.1724 49.4420 49.9309 39.9594 31.4670 48.1406 38.1239 41.7347 3.6646 42.8992 44.7198 27.0309 46.8874 58.2126 70.7662 54.1196 19.5733 23.7360 6.5546 36.6325
temp: 298.150 k
press: 1.00000 atm
elementType: 8 6 6 6 6 6 6 6 6 6 6 6 6 6 6 6 6 6 6 6 1 1 1 1 1 1 1 1 1 1 1 1 1 1 1 1 1 1 1 1 1 1 1 1 1 1
symmnumber: 1
zpe: 1059289.4 jmol-1
zpe.correction: 0.403462 hartree
zpe.thermalcorrener: 0.421601 hartree
zpe.thermalcorrenthalpy: 0.422545 hartree
zpe.thermalcorrgfe: 0.359191 hartree
zpe.sumelectzpe: -813.342885 hartree
zpe.sumelectthermal: -813.324746 hartree
zpe.sumelectthermalent: -813.323802 hartree
zpe.sumelectthermalfe: -813.387155 hartree
dipole: 1.0112 -1.1230 0.3139
dipole: 1.5434
quadrupole: -122.6452 -113.5237 -125.0081
quadrupole: 10.8069 -0.4046 -0.3386
quadrupole: -2.2529 6.8686 -4.6157 10.8069 -0.4046 -0.3386
hfenergy: -813.7463467 hartree
pointgroup: C01 [X(C19H26O1)]
dipole: -0.395885 0.4361455 0.1476034 debye
polarizability: 265.1696173|2.3721093|186.6378076|-1.979535|5.8874827|146.5660013 unknown
InChI: InChI=1S/C19H26O/c1-12-3-8-18-17-6-4-13-11-14(20)5-7-15(13)16(17)9-10-19(12,18)2/h5,7,11-12,16-18,20H,3-4,6,8-10H2,1-2H3
charge 0 multiplicity 1
46 atoms
O  5.912474 0.308874 -0.144714
C  -2.730006 -0.04878 -0.575943
C  -2.040241 -0.906607 0.546608
C  -0.484879 -0.956906 0.552659
C  -4.176972 0.120795 0.014958
C  0.150967 0.448403 0.349178
C  -2.002309 1.320835 -0.723677
C  -2.626191 -0.358502 1.892239
C  -3.959098 0.36806 1.535119
C  -0.473207 1.171409 -0.880326
C  0.128972 -1.969434 -0.447224
C  -2.796519 -0.772467 -1.943151
C  1.677476 0.385029 0.243979
C  -5.072586 1.176634 -0.659684
C  1.633699 -2.153799 -0.163077
C  2.375963 -0.826391 -0.03462
C  2.430529 1.575002 0.404169
C  3.785252 -0.811301 -0.160288
C  3.834976 1.59495 0.287173
C  4.511308 0.38578 -0.003004
H  -2.40496 -1.949338 0.420652
H  -0.186222 -1.311662 1.565099
H  -4.670268 -0.870118 -0.099225
H  -0.100118 1.071836 1.234666
H  -2.201207 1.947756 0.17015
H  -2.418085 1.868806 -1.592132
H  -1.915446 0.340542 2.372158
H  -2.783067 -1.185665 2.608557
H  -4.814928 0.000356 2.130187
H  -3.879965 1.45477 1.732715
H  -0.225766 0.616603 -1.806332
H  -0.008207 2.170315 -0.989954
H  -0.010625 -1.626451 -1.489443
H  -0.389704 -2.94404 -0.358326
H  -3.446901 -0.218965 -2.647315
H  -1.806388 -0.868569 -2.421029
H  -3.213383 -1.791549 -1.828912
H  -4.646229 2.191565 -0.555397
H  -5.210892 0.974317 -1.73849
H  -6.076091 1.190351 -0.194402
H  2.10712 -2.771751 -0.95006
H  1.752485 -2.71842 0.786016
H  1.904171 2.510636 0.632028
H  4.335935 -1.732888 -0.378741
H  4.392106 2.53166 0.420336
H  6.323228 1.20012 -0.020483
