program: Gaussian 09
title: 000243042
version: EM64L-G09RevD.01
frameworkgroup: C1[X(C17H19NO3)]
method: RPBEPBE
basis: SDD
operation: Freq
keyword: #p
keyword: freq=noraman
keyword: PBEPBE/SDD
title: #p freq=noraman PBEPBE/SDD
converged: NO YES NO NO
title: Mulliken charges:
elementType: O O O N C C C C C C C C C C C C C C C C C H H H H H H H H H H H H H H H H H H H
charge: -0.166758 -0.185382 -0.220940 -0.637017 -0.193989 -0.180454 -0.443672 -0.461254 -0.306050 -0.424175 -0.387024 -0.231743 0.096853 0.044607 0.138890 0.329983 -0.328966 -0.350266 -0.257696 -0.232155 -0.223773 0.241955 0.256061 0.222798 0.205131 0.228272 0.216823 0.283509 0.245767 0.203530 0.194354 0.210624 0.299546 0.296359 0.314763 0.226481 0.275755 0.230743 0.234188 0.234320
chargesum: 0.00000
title: Mulliken charges with hydrogens summed into heavy atoms:
elementType: O O O N C C C C C C C C C C C C C C C C C
charge: -0.166758 -0.185382 -0.220940 -0.025895 0.047967 0.075607 -0.015742 -0.016159 -0.022541 0.025123 0.017954 0.067802 0.096853 0.044607 0.138890 0.329983 -0.102485 -0.074512 -0.026953 0.002033 0.010547
polarizability: 2.42513804e+02 -1.76495636e+01 1.75257495e+02 4.17328883e+00 1.24706411e+01 1.57385916e+02
1716.lowfreq: -9.6970 -7.9759 0.0005 0.0005 0.0010 7.1862 26.3528 29.6445 38.4417
frequency: 26.1914 29.6134 38.3377 72.1841 80.2114 107.7531 121.1382 147.0979 168.7160 180.1315 207.6425 251.3792 265.2841 298.8166 306.2381 331.6042 336.9224 349.6686 385.5675 389.1001 397.7722 426.5873 447.7966 473.7820 483.4829 505.5095 581.6092 601.6461 613.6238 616.1781 647.2597 683.5140 691.7349 701.8640 733.7242 754.3446 775.5548 793.7228 821.3740 834.2476 854.1151 871.9766 902.3963 905.4035 925.8576 946.3871 962.5350 972.0763 989.1390 990.4699 1010.1545 1021.9946 1033.0133 1041.4745 1058.9669 1064.6374 1082.5776 1088.6324 1106.8637 1111.8579 1143.9011 1147.8148 1173.5332 1179.4143 1189.0386 1193.8365 1199.1157 1213.8840 1225.9999 1242.2815 1268.1376 1268.7195 1283.4143 1296.0331 1302.0659 1324.3214 1330.6650 1331.0838 1336.9174 1347.4447 1350.7170 1359.1707 1389.3512 1436.4980 1449.3674 1462.7011 1466.1784 1477.0014 1480.7309 1561.7638 1582.5600 1595.8663 1610.8246 1616.6627 1628.9444 2910.6562 2943.0192 2968.1063 2977.5799 2981.6243 2995.3684 3003.0909 3010.7304 3035.6118 3044.7863 3048.2757 3061.2021 3129.2838 3138.0612 3149.2911 3159.8870 3170.4261 3474.2217 3629.5409
redmass: 4.8646 5.1036 4.2353 7.1964 4.7723 5.7002 5.7933 4.3712 4.6739 3.2133 4.4520 4.3414 3.3424 2.5959 3.0958 2.4342 2.0105 3.5043 5.1427 2.7394 2.7815 3.8175 3.8209 4.1890 2.4732 4.1080 2.4822 3.1856 6.3640 2.2743 6.3352 3.2020 1.9235 2.8197 4.0824 3.7090 1.9471 1.8866 3.4373 2.4321 1.2556 2.5904 2.3351 1.9260 2.9928 1.5407 2.2691 3.3883 1.4718 4.9094 1.3477 3.0363 2.4211 2.1646 1.6133 2.2037 2.0034 1.7177 1.3705 1.2579 2.4097 2.2088 1.0940 1.4395 1.2901 1.2908 1.8064 2.3731 1.4127 1.4093 1.5868 2.1217 1.2814 1.3136 1.4272 1.3587 1.3612 1.6978 1.3603 1.5488 1.5596 1.4748 9.0911 2.2784 1.0872 1.0855 1.0856 1.0897 2.2389 5.9161 1.9596 6.6794 6.6089 8.6426 2.2769 1.0793 1.0802 1.0637 1.0615 1.0648 1.0627 1.0816 1.0844 1.0964 1.1007 1.0991 1.1028 1.0851 1.0882 1.0926 1.0961 1.1011 1.0470 1.0973
irintensity: 0.9788 1.3921 0.5198 2.5089 1.7183 1.1982 1.3521 0.7541 3.1023 0.3736 0.6676 8.2337 1.1326 1.8147 6.6282 0.2611 10.4812 11.2608 4.7834 30.3743 0.0863 0.6267 5.9143 13.7910 5.6232 20.5464 113.9438 74.3725 0.8204 80.9066 21.3597 3.8278 41.2190 19.4738 5.0593 6.6129 38.4107 9.1676 8.2871 8.9533 1.3572 0.4629 26.5373 0.6109 15.5864 0.5802 11.6357 13.7985 0.8202 3.2784 0.1876 9.0332 6.1510 38.0645 0.6981 46.0578 6.1918 10.7932 14.1393 4.1918 16.9457 40.0919 7.5269 15.8127 9.3161 34.4402 62.1916 21.4966 16.9649 9.8568 58.4846 139.6952 4.3067 13.9381 23.5497 20.4098 3.8874 5.9302 3.2469 13.3409 1.5387 3.2177 3.3739 24.3240 13.1825 12.5299 9.5786 13.7026 2.4159 206.9318 188.9238 23.9092 11.3454 107.7590 40.3425 38.4079 20.5483 36.5943 20.7306 26.8034 33.4724 4.7590 15.5311 49.6506 42.1746 11.6612 57.4450 1.0736 6.0084 24.9747 18.4455 21.7936 13.8406 23.9996
temp: 298.150 k
press: 1.00000 atm
elementType: 8 8 8 7 6 6 6 6 6 6 6 6 6 6 6 6 6 6 6 6 6 1 1 1 1 1 1 1 1 1 1 1 1 1 1 1 1 1 1 1
symmnumber: 1
zpe: 854828.6 jmol-1
zpe.correction: 0.325587 hartree
zpe.thermalcorrener: 0.344289 hartree
zpe.thermalcorrenthalpy: 0.345233 hartree
zpe.thermalcorrgfe: 0.277748 hartree
zpe.sumelectzpe: -938.088365 hartree
zpe.sumelectthermal: -938.069663 hartree
zpe.sumelectthermalent: -938.068719 hartree
zpe.sumelectthermalfe: -938.136204 hartree
dipole: 0.3534 -2.1406 -1.5280
dipole: 2.6537
quadrupole: -106.4924 -130.4528 -123.7759
quadrupole: 3.5428 -6.0849 9.4589
quadrupole: 13.7480 -10.2124 -3.5356 3.5428 -6.0849 9.4589
hfenergy: -938.4139519 hartree
pointgroup: C01 [X(C17H19N1O3)]
dipole: -0.0914999 0.8028797 -0.6610963 debye
polarizability: 239.148148|-23.3011005|176.4471386|-5.5784197|-12.9186564|159.5619285 unknown
InChI: InChI=1S/C17H19NO3/c18-14-13(15(19)10-6-2-1-3-7-10)16(20)11-8-4-5-9-12(11)17(14)21/h1-3,6-7,11-14H,4-5,8-9,18H2
charge 0 multiplicity 1
40 atoms
O  0.303589 1.558871 0.461156
O  2.58998 -2.97576 -1.162975
O  -1.299411 -1.312205 1.794984
N  0.137723 -3.247329 -0.028337
C  1.977322 0.570266 -1.04562
C  2.904554 -0.619328 -0.612338
C  2.735829 1.918288 -1.016592
C  3.579341 -0.33239 0.764938
C  -0.085195 -0.769906 -0.235556
C  3.466155 2.175312 0.323548
C  4.378606 0.989726 0.712901
C  0.82333 -1.985044 0.188744
C  0.692746 0.565523 -0.204816
C  2.146707 -1.943237 -0.58791
C  -1.334426 -0.730933 0.669853
C  -2.562998 -0.013338 0.210679
C  -2.658416 0.616181 -1.059561
C  -3.680387 0.032009 1.089715
C  -3.845552 1.27489 -1.441898
C  -4.864871 0.689331 0.708195
C  -4.9512 1.312771 -0.560797
H  1.652729 0.361151 -2.089283
H  3.707377 -0.723061 -1.367616
H  2.023336 2.740009 -1.215294
H  3.475465 1.914181 -1.842823
H  4.243512 -1.178578 1.0234
H  2.811673 -0.261994 1.561283
H  -0.38484 -0.970431 -1.283081
H  2.715595 2.343375 1.118053
H  4.064044 3.10287 0.241911
H  5.202702 0.889439 -0.023506
H  4.84869 1.177172 1.697093
H  1.067076 -1.818297 1.264002
H  -0.425326 -3.574449 0.756445
H  0.717484 -3.954327 -0.491399
H  -1.813016 0.601519 -1.755388
H  -3.588209 -0.454926 2.065968
H  -3.910631 1.758618 -2.422431
H  -5.71954 0.719629 1.392579
H  -5.872748 1.824599 -0.859926
