program: Gaussian 09
title: 000243019
version: EM64L-G09RevD.01
frameworkgroup: C1[X(C6H4N2O5)]
method: RPBEPBE
basis: SDD
operation: Freq
keyword: #pfreq=noraman
keyword: PBEPBE/SDD
title: #p freq=noraman PBEPBE/SDD
converged: NO YES NO NO
title: Mulliken charges:
elementType: O O O O O N N C C C C C C H H H H
charge: -0.189007 -0.430648 -0.247434 -0.218153 -0.159032 -0.346559 0.031981 0.245315 0.222948 -0.295842 -0.263517 0.115041 0.133123 0.336941 0.306587 0.360520 0.397736
chargesum: 0.00000
title: Mulliken charges with hydrogens summed into heavy atoms:
elementType: O O O O O N N C C C C C C
charge: -0.189007 -0.032912 -0.247434 -0.218153 -0.159032 0.013961 0.031981 0.245315 0.222948 0.041099 0.043070 0.115041 0.133123
polarizability: 1.58641192e+02 4.70146436e+00 1.17348426e+02 1.53936109e-01 1.60700104e-01 3.73523266e+01
1716.lowfreq: -31.5284 -0.0006 -0.0005 0.0001 3.2382 5.2595 5.5125 61.6720 87.3012
frequency: -31.4898 61.6701 87.2985 136.8579 146.0214 242.8969 278.7403 328.4833 337.1088 394.0193 408.8409 470.4835 502.3589 554.2514 577.2366 598.9542 645.6376 664.9882 721.5742 725.6218 748.4748 768.1211 800.6790 882.3036 965.1393 997.6161 1008.6289 1036.2272 1100.3738 1164.6631 1195.7759 1232.8423 1306.7531 1352.0930 1363.8410 1405.9847 1444.6607 1541.9882 1607.1311 1640.6793 1673.1318 3169.9121 3181.2496 3493.1696 3540.4446
redmass: 15.6389 10.9425 9.0685 9.1981 5.4330 10.4949 6.9811 11.4864 11.9313 12.4810 3.9257 8.6058 2.8745 5.3118 5.9725 1.2501 7.2217 5.9998 9.1298 5.9426 4.0743 6.3255 1.6015 8.7735 1.4517 1.3666 5.2000 2.9550 2.1635 2.8303 3.7912 1.4968 1.7697 3.0464 9.8443 4.3101 2.9185 7.3397 5.0092 8.5856 7.8500 1.0954 1.0920 1.0785 1.0645
irintensity: 0.1661 0.2194 9.3000 3.1948 0.1543 0.8126 4.1257 2.6609 3.1062 0.9645 1.3453 24.4605 60.8105 6.7732 42.5269 82.4213 21.4126 41.2357 19.1153 53.9253 2.9141 4.2214 97.7189 6.3122 5.6914 10.2775 71.4785 202.2821 97.8608 106.4037 302.9928 55.5613 2.8384 55.3828 120.3566 2.2709 9.9651 84.0877 21.9090 481.9795 410.7701 2.6517 11.2851 85.6287 72.0568
temp: 298.150 k
press: 1.00000 atm
elementType: 8 8 8 8 8 7 7 6 6 6 6 6 6 1 1 1 1
symmnumber: 1
zpe: 278161.2 jmol-1
zpe.correction: 0.105946 hartree
zpe.thermalcorrener: 0.116043 hartree
zpe.thermalcorrenthalpy: 0.116988 hartree
zpe.thermalcorrgfe: 0.069455 hartree
zpe.sumelectzpe: -715.652271 hartree
zpe.sumelectthermal: -715.642173 hartree
zpe.sumelectthermalent: -715.641229 hartree
zpe.sumelectthermalfe: -715.688761 hartree
dipole: -5.9481 2.5055 0.0028
dipole: 6.4542
quadrupole: -94.6341 -67.6184 -71.8307
quadrupole: 6.3715 -0.0651 -0.0878
quadrupole: -16.6064 10.4093 6.1971 6.3715 -0.0651 -0.0878
hfenergy: -715.7582168 hartree
pointgroup: C01 [X(C6H4N2O5)]
dipole: -2.3527823 -0.9537373 -0.0527247 debye
dipolederiv: -0.9179454 0.3930448 -0.021166 0.4899602 -0.6396101 0.0148261 -0.0175533 0.0119163 -0.3231892 -0.3937851 0.195443 -0.0003955 0.4190741 -1.2510833 0.0151998 -0.0020712 0.0108552 -0.4205942 -1.2387441 -0.146104 -0.0209704 -0.1367195 -0.6180121 -0.0011398 -0.0236226 -0.0026365 -0.3315562 -0.4599061 -0.0357281 -0.0002123 -0.1321407 -0.8859686 -0.0120101 -0.0017217 -0.0076259 -0.2377995 -0.7749278 0.0214453 -0.0022705 -0.0593251 -0.3721757 -0.0055387 -0.0063056 -0.0061296 -0.1918568 -0.772938 0.6860669 -0.0173271 -0.2037809 -0.3150225 -0.0051371 -0.0148887 0.015616 -0.267066 1.4114174 0.3727012 0.0073959 0.4881307 1.3407746 0.0262482 0.0140599 0.0208125 0.186176 -0.9794609 0.101658 -0.0236707 -0.1429339 -0.7797032 0.0003189 -0.0228245 0.0049186 -0.075427 -0.9327098 -0.3343074 -0.018789 0.3015778 -0.4640727 0.0083961 -0.0205846 -0.0059715 -0.0019759 0.9460823 0.2851547 0.0226688 0.1090859 0.0771648 0.0025352 0.0184417 0.0043611 0.0215406 0.1773849 -0.663334 0.0067466 -0.0862835 0.8212429 -0.0060581 0.0040984 -0.020185 0.060108 1.3534184 -0.5536311 0.0360372 -0.4145461 0.6907575 -0.0152603 0.0351522 -0.0138396 0.2540205 2.0048204 -0.2794318 0.0449461 -0.4854053 1.5110886 -0.0200509 0.0478485 -0.0140108 0.2459067 0.1918733 -0.0036474 0.000413 0.0115909 0.1185439 0.0009543 0.0020461 0.0009071 0.1647646 0.0898488 -0.0419721 -0.0020955 -0.021846 0.1068355 -0.0002946 -0.0011781 0.000095 0.1760012 0.1435968 0.0325217 -0.004947 -0.0270578 0.2820122 -0.0005435 -0.00495 0.0015397 0.3303964 0.1519749 -0.0298795 -0.0063636 -0.1093809 0.3772281 -0.0024456 -0.0059465 -0.0006227 0.4105509 unknown
polarizability: 158.444058|-5.2576708|117.4842319|2.7279129|-0.2903914|37.4136545 unknown
InChI: InChI=1S/C6H4N2O5/c9-5-4(8(12)13)1-3(2-7-5)6(10)11/h1-2,7,10H
charge 0 multiplicity 1
17 atoms
O  2.385326 -1.926946 0.038796
O  -2.818004 1.764833 -0.11148
O  -3.808912 -0.344769 -0.124931
O  1.881242 2.39414 0.02558
O  3.381528 0.675081 0.014648
N  0.063926 -2.036697 -0.020065
N  2.180012 1.131434 0.012701
C  -1.386955 -0.141043 -0.064355
C  1.050488 0.171513 -0.006642
C  -0.235027 0.702506 -0.039725
C  -1.194557 -1.527069 -0.0541
C  1.310328 -1.278862 0.009665
C  -2.775694 0.368441 -0.100771
H  -0.352151 1.789834 -0.04744
H  -2.04478 -2.215682 -0.072742
H  0.219058 -3.052165 -0.011388
H  -3.763929 2.070153 -0.137752
