program: Gaussian 09
title: 000243012
version: EM64L-G09RevD.01
frameworkgroup: C1[X(C12H23NO)]
method: RPBEPBE
basis: SDD
operation: Freq
keyword: #p
keyword: freq=noraman
keyword: PBEPBE/SDD
title: #p freq=noraman PBEPBE/SDD
converged: NO YES NO NO
title: Mulliken charges:
elementType: O N C C C C C C C C C C C C H H H H H H H H H H H H H H H H H H H H H H H
charge: -0.308252 -0.160202 0.326080 -0.093094 -0.443602 -0.045173 -0.418816 -0.406076 -0.009565 -0.724053 -0.738115 -0.717267 -0.358759 -0.739894 0.207163 0.196683 0.188456 0.203918 0.189710 0.200459 0.196874 0.221070 0.236776 0.212986 0.214534 0.213757 0.229524 0.213633 0.201939 0.215538 0.209299 0.213351 0.217542 0.216880 0.214347 0.213803 0.208548
chargesum: 0.00000
title: Mulliken charges with hydrogens summed into heavy atoms:
elementType: O N C C C C C C C C C C C C
charge: -0.308252 -0.160202 0.326080 0.114068 -0.058463 0.158745 -0.028647 0.011868 0.227211 -0.082776 -0.093019 -0.069495 0.066078 -0.103197
polarizability: 1.55495842e+02 4.53875960e+00 1.34920776e+02 -5.17032071e-01 7.92165895e-01 1.18630326e+02
1716.lowfreq: -6.7417 -0.0002 0.0007 0.0010 8.1826 19.6060 35.9450 65.3213 80.3746
frequency: 35.4758 65.2747 80.3413 123.8908 140.1113 173.0653 176.7858 210.3752 222.0660 242.3134 249.3865 260.0093 275.9413 283.0305 301.5091 324.7335 357.1185 380.7067 402.5056 435.2869 440.7843 467.9683 521.8547 525.1709 635.9801 679.8456 740.4591 774.5757 787.9078 837.1509 847.8649 852.9131 874.4803 904.9610 912.9772 929.8686 938.3938 976.2686 981.4948 987.5651 1003.1596 1024.7219 1041.2813 1061.2560 1085.1100 1093.4537 1108.7319 1120.5315 1127.3346 1153.2371 1160.6850 1174.3090 1198.7623 1219.3506 1233.9467 1238.2346 1271.5912 1286.4764 1294.2897 1309.4726 1318.7760 1339.7251 1344.5218 1359.5728 1367.5633 1372.8109 1382.8231 1385.4836 1389.2022 1393.2398 1445.3345 1455.4533 1459.4846 1461.6837 1466.0511 1472.5055 1473.3287 1475.8201 1477.1399 1481.3779 1485.7112 1490.3547 2951.7361 2960.9053 2965.2337 2965.6768 2967.6773 2975.1237 2976.9956 2980.8289 2983.8042 3019.5697 3024.0313 3035.2127 3055.9041 3061.2857 3062.2348 3065.2027 3066.6996 3074.8995 3084.9588 3088.6568 3091.4871 3095.8721 3161.0168
redmass: 2.8858 3.5412 4.3767 2.9877 2.3910 1.4392 1.4526 1.0688 1.9119 1.7435 1.8782 1.3942 2.8763 2.5576 2.2382 2.6269 2.8854 2.4538 1.9352 2.0449 2.8961 2.1658 2.7769 3.4536 2.8662 3.9147 6.5329 3.3540 2.9321 2.0312 1.5008 2.3958 1.3202 1.6946 1.5742 1.7003 2.0724 1.5740 1.5123 1.2992 1.4765 1.3773 1.7198 1.6240 2.4118 1.4467 1.4557 3.1095 1.4644 2.2766 2.1952 2.1074 2.7486 1.5818 1.6466 2.0943 1.7543 1.2793 1.4543 1.6579 1.3333 1.2814 1.4791 1.5450 1.2149 1.3172 1.2087 1.2304 1.3833 1.5982 1.0822 1.0739 1.0636 1.0758 1.0616 1.0547 1.0814 1.0891 1.0602 1.0722 1.1011 1.0601 1.0781 1.0617 1.0597 1.0420 1.0725 1.0358 1.0550 1.0374 1.0460 1.1016 1.1019 1.1021 1.0530 1.0992 1.0992 1.0993 1.0985 1.0982 1.0995 1.0991 1.0918 1.0966 1.1185
irintensity: 1.4541 1.0351 3.7549 0.4418 0.0246 0.2186 0.2944 0.0586 3.3897 1.7348 5.4640 1.2014 6.1429 0.7236 0.5712 0.9013 1.4015 3.0730 0.2637 0.8763 3.4581 1.6383 1.5752 9.8668 3.9192 11.0623 16.3922 23.6072 12.1546 6.1069 2.8203 0.7300 3.8672 2.0574 1.2238 2.7625 24.5309 3.8865 2.1971 0.6767 5.2577 4.6115 4.7354 8.6149 1.9112 9.0091 4.0799 14.4965 32.3668 21.8911 1.0640 33.5831 20.6090 5.5378 1.3193 36.2851 19.4294 5.8119 13.0965 18.9498 2.8162 20.7934 3.4158 7.5812 16.6795 8.5124 38.3528 8.1235 14.4058 8.1733 2.6340 4.8775 4.0669 0.5131 5.3641 3.6274 3.5154 21.3213 9.7118 6.7599 11.5376 15.0929 15.5929 7.4757 9.5521 52.2493 41.6330 17.6081 76.6776 54.7726 7.6898 21.0578 27.3473 34.8653 31.2088 55.3483 23.4885 29.0439 61.6817 66.4692 18.7539 45.2139 27.3580 43.2869 36.8513
temp: 298.150 k
press: 1.00000 atm
elementType: 8 7 6 6 6 6 6 6 6 6 6 6 6 6 1 1 1 1 1 1 1 1 1 1 1 1 1 1 1 1 1 1 1 1 1 1 1
symmnumber: 1
zpe: 864764.4 jmol-1
zpe.correction: 0.329371 hartree
zpe.thermalcorrener: 0.345304 hartree
zpe.thermalcorrenthalpy: 0.346248 hartree
zpe.thermalcorrgfe: 0.287367 hartree
zpe.sumelectzpe: -599.836922 hartree
zpe.sumelectthermal: -599.820990 hartree
zpe.sumelectthermalent: -599.820045 hartree
zpe.sumelectthermalfe: -599.878926 hartree
dipole: 2.5291 -1.2401 -0.0856
dipole: 2.8180
quadrupole: -101.7113 -86.4595 -87.3673
quadrupole: 7.4147 1.4185 -0.1906
quadrupole: -9.8652 5.3865 4.4787 7.4147 1.4185 -0.1906
hfenergy: -600.1662938 hartree
pointgroup: C01 [X(C12H23N1O1)]
dipole: 1.0554982 0.2796603 0.1921655 debye
polarizability: 153.7277923|-6.9041743|132.2835324|-2.6150411|7.7709226|123.035619 unknown
InChI: InChI=1S/C12H23NO/c1-9-5-10(2)13(7-11-8-14-11)12(3,4)6-9/h9-11H,5-8H2,1-4H3
charge 0 multiplicity 1
37 atoms
O  -4.120105 -0.28744 0.224237
N  -0.270561 -0.206778 -0.176173
C  0.533767 1.046857 -0.001138
C  0.385455 -1.448033 -0.681146
C  1.863476 0.688601 0.728678
C  2.631375 -0.509781 0.129161
C  1.684999 -1.73066 0.107743
C  -1.683843 -0.068942 -0.58734
C  -2.640849 -0.387787 0.559762
C  0.836691 1.783805 -1.348393
C  -0.236888 2.028602 0.923274
C  0.63071 -1.507773 -2.222534
C  -3.488332 0.647103 1.229191
C  3.919406 -0.805761 0.926627
H  -0.325588 -2.268428 -0.447909
H  1.623124 0.44916 1.785307
H  2.508858 1.589789 0.735927
H  2.924991 -0.265186 -0.913019
H  2.195357 -2.609081 -0.33398
H  1.422345 -1.98793 1.15373
H  -1.90953 0.940833 -0.982019
H  -1.914379 -0.771909 -1.413672
H  -2.384305 -1.291769 1.129761
H  1.255224 2.789283 -1.153641
H  1.561235 1.230426 -1.969371
H  -0.088236 1.913313 -1.940971
H  -0.559515 1.512699 1.844731
H  0.424933 2.868811 1.203064
H  -1.126468 2.459419 0.429988
H  -3.816974 0.498723 2.265818
H  -3.415121 1.691711 0.899127
H  1.47935 -0.876777 -2.536977
H  0.852387 -2.548239 -2.527031
H  -0.262009 -1.177732 -2.785232
H  4.47208 -1.659329 0.490975
H  4.596707 0.06885 0.937198
H  3.680033 -1.05985 1.977448
