program: Gaussian 09
title: 000242998
version: EM64L-G09RevD.01
frameworkgroup: C1[X(C8H12O)]
method: RPBEPBE
basis: SDD
operation: Freq
keyword: #pfreq=noraman
keyword: PBEPBE/SDD
title: #p freq=noraman PBEPBE/SDD
converged: YES YES NO NO
title: Mulliken charges:
elementType: O C C C C C C C C H H H H H H H H H H H H
charge: -0.248458 -0.143749 -0.144111 -0.339530 -0.338983 -0.506521 -0.506090 -0.192020 -0.192059 0.254308 0.254391 0.226000 0.183891 0.183436 0.226260 0.215709 0.204605 0.204491 0.215655 0.221416 0.221359
chargesum: 0.00000
title: Mulliken charges with hydrogens summed into heavy atoms:
elementType: O C C C C C C C C
charge: -0.248458 0.110559 0.110281 0.070362 0.070713 -0.086208 -0.085945 0.029396 0.029300
polarizability: 8.69447334e+01 1.47383943e-02 9.15760413e+01 -1.44870748e+00 -1.29402512e-02 6.17469345e+01
1716.lowfreq: -20.8038 -10.3415 0.0003 0.0004 0.0006 3.5727 25.7784 148.0884 208.6605
frequency: 23.7728 148.0878 208.6592 319.9531 338.6350 397.0596 427.1567 508.6743 577.9823 605.0837 700.0832 725.3302 737.7277 874.7809 901.0888 911.9109 938.6590 942.4881 959.8932 1001.1063 1014.1086 1034.3521 1035.7976 1081.4840 1090.8245 1093.0167 1157.5601 1159.9248 1197.3740 1212.4582 1224.0633 1272.8069 1274.1068 1302.0668 1302.3516 1307.2043 1309.0748 1330.1345 1352.7566 1361.4895 1458.8607 1466.4221 1469.5113 1477.6453 1652.5788 2923.9783 2930.5169 2942.1896 2945.8280 3008.8318 3025.0890 3037.8947 3045.2043 3078.9491 3085.4288 3114.7015 3148.2931
redmass: 2.3228 2.2101 2.7729 3.2507 1.9954 2.3366 4.6865 3.5943 2.3164 2.9578 1.5695 2.7068 2.7511 4.2171 1.6472 1.6060 2.3122 2.9260 1.4939 5.4947 1.6835 3.1220 2.3257 2.1349 2.3550 2.6227 1.2147 1.1123 1.1800 1.2366 1.2927 1.2504 1.2337 1.2509 1.4024 1.2751 1.1565 1.5658 1.3622 1.6209 1.0833 1.0910 1.0817 1.0916 6.4389 1.0689 1.0702 1.0674 1.0670 1.0843 1.0863 1.0934 1.0926 1.0937 1.0970 1.0852 1.1024
irintensity: 0.0020 0.2733 10.6272 0.8573 2.6476 0.6986 1.8811 0.1884 1.8264 16.3724 58.8043 0.7296 12.6283 19.5624 8.5481 0.2902 12.1836 0.5944 5.1848 30.2751 2.9056 11.0252 0.5854 0.7412 8.6547 3.4952 0.8172 1.4142 2.1861 0.3307 7.9813 4.9238 1.6731 0.4448 0.8566 1.5504 1.7870 0.1198 1.3814 1.2040 2.5389 3.2645 3.6716 14.5281 4.0909 53.2852 43.9523 89.1676 25.2097 1.1543 15.0554 54.3177 30.9993 45.5696 48.8206 9.0229 50.7510
temp: 298.150 k
press: 1.00000 atm
elementType: 8 6 6 6 6 6 6 6 6 1 1 1 1 1 1 1 1 1 1 1 1
symmnumber: 1
zpe: 479541.1 jmol-1
zpe.correction: 0.182648 hartree
zpe.thermalcorrener: 0.190516 hartree
zpe.thermalcorrenthalpy: 0.191460 hartree
zpe.thermalcorrgfe: 0.149330 hartree
zpe.sumelectzpe: -386.532652 hartree
zpe.sumelectthermal: -386.524783 hartree
zpe.sumelectthermalent: -386.523839 hartree
zpe.sumelectthermalfe: -386.565970 hartree
dipole: 1.9718 -0.0024 0.2122
dipole: 1.9832
quadrupole: -63.5899 -49.1418 -54.9838
quadrupole: 0.0122 -0.9993 0.0019
quadrupole: -7.6847 6.7634 0.9214 0.0122 -0.9993 0.0019
hfenergy: -386.7152995 hartree
pointgroup: C01 [X(C8H12O1)]
dipole: 0.7566772 -0.1595522 -0.1037765 debye
dipolederiv: -0.647321 -0.0024405 0.0232718 -0.0076496 -0.6646503 0.0103936 -0.0873963 0.032915 -0.3967694 -0.016624 0.0100357 -0.0149701 0.1057783 -0.0627618 0.05591 -0.0744752 0.1240879 0.0980503 -0.0684801 -0.0133041 -0.0302881 -0.1172969 -0.0265107 -0.0290295 -0.1006195 -0.0707964 0.1137007 0.3520533 0.1533498 -0.0425 0.0512143 0.4103259 -0.0211663 0.0378431 -0.1091458 0.3885425 0.2899569 -0.1033486 -0.0188685 0.009214 0.4870481 0.0254164 0.0786468 0.0771283 0.3750803 -0.0838141 0.0718994 0.0066418 0.0575156 0.1417061 0.0454038 -0.0167527 0.0621505 0.1527951 -0.0970799 0.0265584 -0.0086716 0.0375055 0.1430238 -0.0441204 -0.039066 -0.0501242 0.1651189 0.0963771 -0.0976073 0.0929277 -0.1136258 0.0231538 -0.0415949 0.1125661 -0.1030886 -0.2297935 0.1667199 0.0510693 0.0874541 0.0709603 -0.0380781 -0.0220446 0.1275004 0.0277317 -0.2385197 0.0179818 -0.0172315 -0.0219677 -0.0195175 0.0102878 -0.0451056 -0.0129782 -0.0768177 -0.1337048 0.0300587 0.0094041 -0.0067945 0.0131961 0.010804 0.0334125 0.0136114 0.0592302 -0.1462487 0.0404882 0.0508398 0.0144697 0.0518641 -0.1345903 -0.046652 0.0397008 -0.0926029 0.0507546 0.0005973 -0.0697973 0.0622103 -0.0247768 0.0165123 0.0033655 0.0355572 0.1090527 -0.2187194 0.0376229 0.0646015 0.0450485 0.0140769 -0.0373174 -0.0469956 -0.0157216 -0.1346948 -0.2024039 -0.020695 -0.0928191 0.0429533 -0.0898884 -0.058056 0.0506081 0.0838637 0.0829078 0.0360116 0.0275819 -0.0652236 0.0044204 -0.070011 -0.1708671 -0.0111148 0.0019334 -0.0398499 0.0789485 0.0431991 0.0594535 -0.090253 0.0051133 0.0438991 -0.0317354 -0.0335729 0.0269326 -0.143954 0.0177831 -0.0581741 -0.0684924 0.0008952 0.0702926 0.0397795 -0.0453225 -0.0354443 -0.1446894 0.0464958 -0.0240231 0.0120144 -0.0189198 -0.1806032 0.0390702 0.0202663 0.0667581 0.0695649 -0.1483933 -0.0414457 -0.0433004 -0.064506 0.0380728 0.0019039 -0.0613479 0.0012565 0.1652398 -0.0845085 0.0882032 -0.0453057 0.1088581 -0.0216912 0.0342957 -0.0642364 0.0424134 0.1609955 unknown
polarizability: 87.194101|0.9039257|91.2861625|0.4233947|-1.8417868|61.7874457 unknown
InChI: InChI=1S/C8H12O/c1-2-4-8-6-9-5-7(8)3-1/h1-2,7-8H,3-6H2
charge 0 multiplicity 1
21 atoms
O  -2.482475 0.532302 0.21934
C  -0.103774 0.872707 0.531327
C  -0.41878 -0.671267 0.621564
C  -1.397112 1.488632 -0.071528
C  -1.860965 -0.79576 0.055703
C  1.18148 1.202066 -0.28114
C  0.620083 -1.565062 -0.115382
C  2.311129 0.242465 0.055821
C  2.041081 -1.087536 0.136052
H  0.037639 1.254689 1.558079
H  -0.41833 -0.960077 1.687674
H  -1.694067 2.449928 0.377681
H  -1.290315 1.617118 -1.172354
H  -1.831996 -1.071112 -1.022764
H  -2.500295 -1.512646 0.595538
H  1.483228 2.251555 -0.109201
H  0.946887 1.117207 -1.365342
H  0.412223 -1.521789 -1.207412
H  0.494459 -2.621808 0.183836
H  3.323505 0.632925 0.214874
H  2.825794 -1.819235 0.362936
