program: Gaussian 09
title: 000242995
version: EM64L-G09RevD.01
frameworkgroup: C1[X(C6H12O3)]
method: RPBEPBE
basis: SDD
operation: Freq
keyword: #pfreq=noraman
keyword: PBEPBE/SDD
title: #p freq=noraman PBEPBE/SDD
converged: YES YES NO NO
title: Mulliken charges:
elementType: O O O C C C C C C H H H H H H H H H H H H
charge: -0.291703 -0.243588 -0.450015 -0.495189 -0.247618 0.189220 -0.201980 -0.361869 -0.677669 0.236024 0.228112 0.216801 0.206134 0.190090 0.195860 0.219544 0.259849 0.206979 0.232885 0.227789 0.360345
chargesum: 0.00000
title: Mulliken charges with hydrogens summed into heavy atoms:
elementType: O O O C C C C C C
charge: -0.291703 -0.243588 -0.089671 -0.031053 0.175317 0.189220 0.183970 0.117524 -0.010016
polarizability: 8.20921968e+01 4.88585133e-01 7.63479636e+01 3.18342820e+00 -1.70320614e+00 6.78689148e+01
1716.lowfreq: -4.9629 -0.0007 -0.0005 0.0004 5.7260 15.8555 34.4980 46.4327 61.4318
frequency: 33.7709 46.3330 61.3856 113.8508 136.9988 161.9441 223.0482 239.1582 266.5402 368.7370 387.8719 410.7958 437.9848 532.0515 627.6485 781.0633 815.0298 818.4836 883.5261 939.1112 976.6820 1025.6687 1031.4572 1054.7536 1074.1722 1112.2844 1136.9129 1152.4567 1179.9790 1196.2400 1229.8218 1253.6214 1256.6732 1319.0250 1336.5942 1382.6463 1388.7363 1401.0868 1443.4881 1448.4968 1460.6935 1474.2013 1483.1845 1495.1966 1614.8678 2925.1162 2936.6729 2954.2021 2976.3018 2989.1699 2996.0441 2996.2459 3018.4788 3086.2472 3094.5670 3102.3761 3423.3571
redmass: 5.2934 4.4457 1.7350 4.3171 2.9151 2.9353 2.1476 1.3134 3.5842 2.0201 2.8763 2.7347 1.5436 2.5837 3.0554 2.4604 1.4251 1.8982 1.8177 2.5450 2.6509 2.3037 3.6290 2.1274 4.8302 2.0456 1.4476 2.0271 1.1135 1.2025 1.2582 1.1494 1.5160 1.3967 1.2566 1.4020 1.2666 1.3507 1.1177 1.0814 1.0409 1.0774 1.0539 1.0807 7.6425 1.0554 1.0551 1.0587 1.1066 1.1042 1.0606 1.0736 1.0618 1.1038 1.0991 1.1011 1.0642
irintensity: 2.4923 0.5283 2.7822 7.4715 8.7181 2.0148 4.5284 2.2088 19.0197 31.5184 12.5178 2.2942 86.0030 8.0758 3.6905 10.6319 9.1537 0.5135 3.2761 24.3811 34.6341 7.5161 84.7905 24.4087 148.9343 17.0579 5.1233 19.7870 5.9195 17.3431 18.2304 0.6117 71.5833 63.2359 24.5156 62.0085 8.8251 16.9350 12.5600 17.9758 12.6329 10.5085 1.6495 7.0773 90.6384 32.3904 108.0325 32.8759 62.5468 24.9790 24.8871 6.2345 26.8714 14.8445 34.3023 36.0557 23.0585
temp: 298.150 k
press: 1.00000 atm
elementType: 8 8 8 6 6 6 6 6 6 1 1 1 1 1 1 1 1 1 1 1 1
symmnumber: 1
zpe: 458845.9 jmol-1
zpe.correction: 0.174765 hartree
zpe.thermalcorrener: 0.185914 hartree
zpe.thermalcorrenthalpy: 0.186858 hartree
zpe.thermalcorrgfe: 0.136484 hartree
zpe.sumelectzpe: -460.731306 hartree
zpe.sumelectthermal: -460.720158 hartree
zpe.sumelectthermalent: -460.719214 hartree
zpe.sumelectthermalfe: -460.769587 hartree
dipole: -3.6002 -2.7065 -1.2187
dipole: 4.6660
quadrupole: -56.5185 -57.3819 -54.5668
quadrupole: -3.6964 -4.7264 2.9389
quadrupole: -0.3628 -1.2262 1.5889 -3.6964 -4.7264 2.9389
hfenergy: -460.9060715 hartree
pointgroup: C01 [X(C6H12O3)]
dipole: 1.4631315 -1.0806474 0.2479504 debye
dipolederiv: -0.9649077 -0.3396139 -0.0867378 -0.3812092 -0.7133662 -0.0691019 -0.0932814 -0.08088 -0.4289643 -0.5157396 0.1197835 -0.1429691 0.1915823 -0.4843085 0.0107972 -0.2130668 -0.0379773 -0.8134794 -0.6768274 0.1260445 -0.0395751 0.1672917 -0.6486891 0.1390783 -0.0442455 0.1405391 -0.2846793 -0.3805899 0.1532655 -0.0437542 0.1624139 -0.1469685 0.0389033 0.0431874 -0.030667 0.0902044 0.5505446 0.0562542 0.0975881 0.271011 0.5896805 0.0864231 0.128951 0.1627184 0.3920136 0.5304044 -0.3257583 0.1323727 -0.4628428 0.5314872 0.1339523 0.2217981 0.1786028 0.8896982 0.8191115 0.2189851 0.045865 0.1691486 0.4350091 -0.0667984 -0.0615742 -0.1164675 0.3531005 0.4248961 -0.0615592 0.0723622 -0.0207182 0.2741024 -0.339407 0.1988664 -0.4373791 -0.092966 -0.0094154 -0.0615381 -0.033654 -0.0764216 -0.0742552 -0.0723935 -0.0249529 -0.0695748 0.0159099 0.049781 -0.0501516 -0.0286492 -0.0239504 -0.0492376 -0.0496718 -0.050841 -0.0798239 0.0543333 0.068223 0.0129283 0.0184647 0.0416654 0.0859966 0.0039383 0.0266068 0.0621537 -0.1132324 0.0241781 -0.0253309 0.0090417 -0.0607222 -0.0035912 0.0566911 -0.0030427 -0.0381237 -0.1751546 -0.1058827 0.1650339 -0.0246785 0.0371277 -0.1578243 -0.0112251 -0.0619393 0.0196774 0.0421699 -0.1572827 0.0452171 -0.0171488 0.1516163 -0.1421109 0.0138215 -0.0065904 0.0379719 0.0493527 -0.0343262 -0.0487995 -0.0395543 -0.0392846 0.0214105 0.0234186 0.0784789 0.0627098 -0.215 0.0316623 -0.0235149 0.0841019 -0.0169693 -0.0413509 0.123536 0.0149388 0.1190663 -0.010332 -0.036566 0.009 -0.0687443 -0.0408107 0.0530069 -0.0170665 -0.0883001 0.0395995 0.0824481 -0.1350774 -0.1062368 0.0388761 -0.0923121 0.0541942 -0.0049066 0.0563256 0.0069742 0.0861875 0.0116665 0.1480247 -0.0192674 0.1017874 -0.0311974 0.0147295 -0.0483882 0.0175368 0.0761894 0.1210286 0.0111919 0.025346 -0.0023135 0.0654336 0.0678414 -0.0123015 0.0239845 -0.139225 0.3851188 -0.0232256 0.0207143 -0.0760896 0.3825787 -0.0825597 -0.0606291 0.0193588 0.1414254 unknown
polarizability: 81.4221638|-1.6583869|73.9216119|3.9812172|4.1005931|70.9652995 unknown
InChI: InChI=1S/C6H12O3/c1-2-9-4-3-6(8)5-7/h7H,2-5H2,1H3
charge 0 multiplicity 1
21 atoms
O  1.288608 -0.312695 0.233359
O  -1.908222 -0.488069 -1.653994
O  -2.763516 1.375388 0.09973
C  -0.577762 -1.810739 -0.089269
C  0.865448 -1.491274 -0.52881
C  -1.508847 -0.667383 -0.4674
C  2.645353 0.138754 -0.12111
C  -1.920276 0.320433 0.616962
C  2.966159 1.357599 0.742244
H  -0.909642 -2.727811 -0.608982
H  -0.5887 -1.98665 1.001038
H  0.894841 -1.284587 -1.620381
H  1.531126 -2.35463 -0.310089
H  3.370697 -0.684952 0.06266
H  2.680243 0.393835 -1.203122
H  -2.452267 -0.22991 1.422519
H  -0.985774 0.733462 1.052407
H  3.976258 1.739477 0.507696
H  2.235647 2.164033 0.55826
H  2.930927 1.094556 1.813447
H  -2.862302 1.206963 -0.880766
