program: Gaussian 09
title: 000243014
version: EM64L-G09RevD.01
frameworkgroup: C1[X(C13H20O)]
method: RPBEPBE
basis: SDD
operation: Freq
keyword: #pfreq=noraman
keyword: PBEPBE/SDD
title: #p freq=noraman PBEPBE/SDD
converged: YES YES NO NO
title: Mulliken charges:
elementType: O C C C C C C C C C C C C C H H H H H H H H H H H H H H H H H H H H
charge: -0.450815 0.197440 -0.381693 0.343297 -0.744146 -0.784650 -0.022683 -0.548323 -0.725466 0.345618 0.478775 -0.648375 -0.886346 -0.828586 0.183049 0.248117 0.261748 0.209882 0.199872 0.217647 0.214884 0.220714 0.254677 0.209104 0.211806 0.230157 0.236158 0.251784 0.230979 0.233004 0.220610 0.227674 0.227368 0.366720
chargesum: 0.00000
title: Mulliken charges with hydrogens summed into heavy atoms:
elementType: O C C C C C C C C C C C C C
charge: -0.084095 0.197440 0.049473 0.343297 -0.072644 -0.131405 -0.022683 -0.293647 -0.074399 0.345618 0.478775 -0.412217 -0.170579 -0.152935
polarizability: 1.69527871e+02 1.21483778e+00 1.58114464e+02 5.54751345e+00 -4.62204854e-01 1.03836440e+02
1716.lowfreq: -10.4846 -0.0002 0.0005 0.0006 4.4647 13.3442 37.8383 55.3841 67.2938
frequency: 37.7348 55.3155 67.2923 94.6282 151.0703 163.9601 181.1985 192.3756 205.6550 231.0879 236.2848 259.2713 274.8393 293.3704 326.9372 328.6281 341.3816 350.9594 366.6313 394.0812 453.7519 456.8400 499.3244 543.9335 549.2882 584.8769 603.6125 738.5589 749.1220 764.5320 789.0999 865.9683 874.1741 902.6420 922.8647 938.7753 958.7731 993.3990 994.3930 1009.1301 1013.1734 1040.6229 1048.3964 1054.0392 1066.8736 1136.0877 1154.6994 1165.3516 1203.3923 1213.7766 1233.4200 1275.0803 1290.0497 1325.7434 1331.9003 1372.1160 1380.2163 1386.8433 1392.5221 1396.6853 1397.8449 1418.9793 1440.5954 1460.8851 1470.3212 1471.1025 1473.2106 1479.4101 1480.6467 1481.5555 1484.1101 1487.9406 1495.4540 1502.3853 1604.8903 1618.9220 2946.0798 2971.3855 2971.7549 2973.8227 2974.7534 2978.8355 3012.3556 3047.8393 3052.1158 3059.8799 3067.6743 3068.2495 3074.6933 3077.9616 3080.0826 3085.0670 3103.7810 3117.0857 3151.6428 3573.6965
redmass: 1.0635 2.9059 2.8581 2.2913 1.3072 1.6480 2.2930 2.6680 2.0796 1.5670 1.1165 2.3607 1.5046 2.0753 1.2011 3.2184 2.1489 3.3870 3.9706 2.6672 3.2783 4.2197 3.2925 3.0989 3.3541 3.6959 3.3985 4.1786 3.8751 2.6820 1.3470 1.3985 2.2393 1.4761 1.7418 1.6273 4.0392 1.3359 1.4940 1.4747 1.5069 1.5063 1.5444 1.7153 2.0027 2.7795 1.8086 2.7238 2.4929 1.7919 1.9096 1.4012 1.6848 3.2097 1.4124 1.2582 2.9439 1.2231 1.2311 1.2522 1.4125 2.9014 1.9500 1.0619 1.0460 1.0458 1.0651 1.0485 1.1066 1.0666 1.0612 1.0534 1.3721 1.0896 6.4194 6.0727 1.0404 1.0371 1.0412 1.0518 1.0359 1.0454 1.0979 1.0978 1.0956 1.0995 1.0977 1.0989 1.0991 1.0985 1.0990 1.0937 1.0980 1.0917 1.0897 1.0652
irintensity: 0.3115 0.0470 0.7482 0.0992 0.0483 1.2684 1.6994 0.6709 4.8911 0.3152 0.0399 14.4957 73.2708 14.5151 0.1675 1.8343 0.5167 3.1647 1.5629 0.7716 0.3689 2.6459 1.9082 0.3015 0.8967 7.7223 3.1004 10.1202 4.7435 7.5358 11.5106 17.2833 7.2906 1.6364 4.6053 4.1767 4.0437 4.5316 0.7137 9.1972 11.6875 1.8473 14.3533 3.1680 1.9529 17.3694 148.6549 26.6000 7.1466 13.8377 0.6170 38.7565 2.3803 10.5625 1.4736 12.3290 1.7926 27.9235 10.8190 3.6182 32.4584 8.6511 48.9544 0.6532 10.6683 9.0519 8.0950 15.2305 3.1336 3.2807 10.9160 15.2259 41.3663 4.9240 1.9055 2.3362 41.8896 52.5361 4.2105 38.5026 59.7996 51.7476 23.2926 22.8031 4.4038 8.4845 69.1031 44.1210 60.4679 15.9114 47.3355 12.8266 14.4202 22.0583 9.2582 25.5568
temp: 298.150 k
press: 1.00000 atm
elementType: 8 6 6 6 6 6 6 6 6 6 6 6 6 6 1 1 1 1 1 1 1 1 1 1 1 1 1 1 1 1 1 1 1 1
symmnumber: 1
zpe: 773886.7 jmol-1
zpe.correction: 0.294758 hartree
zpe.thermalcorrener: 0.311006 hartree
zpe.thermalcorrenthalpy: 0.311950 hartree
zpe.thermalcorrgfe: 0.252210 hartree
zpe.sumelectzpe: -581.523994 hartree
zpe.sumelectthermal: -581.507746 hartree
zpe.sumelectthermalent: -581.506802 hartree
zpe.sumelectthermalfe: -581.566542 hartree
dipole: 1.6105 -0.8791 0.1655
dipole: 1.8422
quadrupole: -82.2812 -77.3843 -90.6587
quadrupole: -4.1703 0.6283 -0.7845
quadrupole: 1.1602 6.0571 -7.2173 -4.1703 0.6283 -0.7845
hfenergy: -581.818752 hartree
pointgroup: C01 [X(C13H20O1)]
dipole: 0.6259442 0.358114 -0.0726022 debye
polarizability: 169.4889171|-1.0349617|158.0566877|-6.0044443|-1.0137408|103.9331695 unknown
InChI: InChI=1S/C13H20O/c1-6-13(4,5)11-8-9(2)7-10(3)12(11)14/h7-8,14H,6H2,1-5H3
charge 0 multiplicity 1
34 atoms
O  -0.392863 2.242484 0.194632
C  -1.85779 -0.276602 0.427527
C  -2.618905 0.444562 -0.741944
C  -0.324203 -0.19849 0.222505
C  -2.233654 0.42368 1.770854
C  -2.359559 -1.743108 0.516733
C  0.365898 1.04649 0.115445
C  0.47585 -1.364334 0.141386
C  -2.332522 -0.101376 -2.157673
C  1.773595 1.123979 -0.062462
C  1.882985 -1.336659 -0.032787
C  2.515002 -0.078516 -0.134337
C  2.461786 2.475715 -0.170303
C  2.679767 -2.629262 -0.10482
H  -3.704187 0.359701 -0.526222
H  -2.367358 1.518588 -0.710001
H  -1.932617 1.483455 1.763518
H  -1.73815 -0.07681 2.623582
H  -3.328001 0.371393 1.929511
H  -3.457268 -1.739262 0.649237
H  -1.921341 -2.272387 1.3833
H  -2.13536 -2.326523 -0.394124
H  -0.010063 -2.341989 0.216784
H  -2.879976 0.488523 -2.916432
H  -2.645377 -1.155903 -2.270357
H  -1.255042 -0.040869 -2.397369
H  3.602534 -0.024456 -0.270374
H  3.547465 2.346097 -0.310545
H  2.097705 3.068787 -1.034991
H  2.329346 3.091062 0.743652
H  3.75499 -2.432449 -0.258961
H  2.577668 -3.21968 0.825674
H  2.334529 -3.273028 -0.936029
H  0.199815 3.028189 0.095189
