program: Gaussian 09
title: 000020501
version: EM64L-G09RevD.01
frameworkgroup: C1[X(C8H6O5)]
method: RPBEPBE
basis: SDD
operation: Freq
keyword: #p
keyword: freq=noraman
keyword: PBEPBE/SDD
title: #p freq=noraman PBEPBE/SDD
converged: YES YES NO NO
title: Mulliken charges:
elementType: O O O O O C C C C C C C C H H H H H H
charge: -0.505832 -0.413661 -0.256756 -0.459855 -0.225657 0.319960 -0.443646 0.318857 -0.483267 0.202637 0.223239 -0.410788 0.122011 0.268838 0.287540 0.271574 0.390239 0.399416 0.395151
chargesum: 0.00000
title: Mulliken charges with hydrogens summed into heavy atoms:
elementType: O O O O O C C C C C C C C
charge: -0.115594 -0.014244 -0.256756 -0.064704 -0.225657 0.319960 -0.174809 0.318857 -0.195727 0.202637 0.223239 -0.139214 0.122011
polarizability: 1.44950358e+02 -3.46460595e+00 1.48414029e+02 4.42100716e-03 5.36588681e-03 4.17504940e+01
1716.lowfreq: -7.6271 -4.5828 -0.0011 -0.0009 -0.0005 3.3584 39.6647 56.7908 122.1972
frequency: 39.6606 56.7905 122.1970 179.0022 190.5916 202.0255 288.0976 330.3490 354.1868 362.4848 397.2310 403.4676 440.2919 445.3382 479.5152 563.0480 596.0714 614.3559 622.0434 657.8476 660.1501 695.4232 740.3017 760.9729 882.5007 894.0055 911.7674 928.4545 973.4165 1050.7338 1065.9807 1119.5060 1164.7512 1184.8068 1270.2977 1289.8091 1310.1486 1354.6986 1365.1622 1466.6592 1496.5302 1582.2174 1625.8832 1641.2685 1654.3962 3125.7533 3132.3278 3148.2863 3469.6587 3533.0835 3613.0858
redmass: 9.6010 7.8296 7.8384 7.8994 5.1228 4.2820 10.5128 7.0948 6.4510 1.4904 7.6370 2.2445 7.2354 10.2752 3.4408 1.1168 5.1113 4.7328 1.3071 2.4296 7.1594 5.0907 5.5490 5.7174 1.5351 5.8723 1.5245 5.0243 1.5617 2.7814 2.5200 1.6903 3.3486 1.5614 1.6241 1.8104 2.1241 2.1163 1.8611 2.5652 6.1879 8.8595 7.6401 6.9663 8.4266 1.0885 1.0892 1.0887 1.0643 1.0643 1.0666
irintensity: 0.0067 0.1429 2.1643 1.6859 4.1328 0.0341 4.4978 0.5750 6.6969 109.6916 7.2881 58.5178 12.1682 11.4871 19.1003 176.5812 47.9231 14.5477 107.3468 4.1981 17.8772 0.0673 52.5753 19.9581 21.6477 19.1676 24.5553 39.4515 16.8566 46.3942 463.4450 97.6547 196.1642 162.5323 2.5311 51.7184 27.8781 66.4190 118.7585 61.8515 184.2112 155.5481 35.6078 97.3992 131.3887 8.6392 5.2721 1.1541 133.1964 53.1571 79.6485
temp: 298.150 k
press: 1.00000 atm
elementType: 8 8 8 8 8 6 6 6 6 6 6 6 6 1 1 1 1 1 1
symmnumber: 1
zpe: 337685.7 jmol-1
zpe.correction: 0.128618 hartree
zpe.thermalcorrener: 0.140124 hartree
zpe.thermalcorrenthalpy: 0.141068 hartree
zpe.thermalcorrgfe: 0.090535 hartree
zpe.sumelectzpe: -683.602779 hartree
zpe.sumelectthermal: -683.591273 hartree
zpe.sumelectthermalent: -683.590329 hartree
zpe.sumelectthermalfe: -683.640862 hartree
dipole: -0.5316 -8.5590 -0.0110
dipole: 8.5755
quadrupole: -74.6055 -76.9193 -75.2298
quadrupole: 1.7394 0.0105 0.0053
quadrupole: 0.9794 -1.3344 0.3550 1.7394 0.0105 0.0053
hfenergy: -683.7313971 hartree
pointgroup: C01 [X(C8H6O5)]
dipole: -0.189088 3.3625224 0.2018204 debye
dipolederiv: -0.5057182 -0.4614836 -0.0291312 -0.7026367 -1.2093131 -0.0556273 -0.043314 -0.052455 -0.443871 -1.248024 -0.6044537 -0.046786 -0.3853248 -0.4265858 -0.0056388 -0.0334351 -0.0079796 -0.4102898 -0.4326304 0.061099 0.0026088 -0.0714793 -1.1677188 -0.0487739 -0.0054459 -0.0463221 -0.3625989 -0.5304028 0.3581914 0.0211315 0.4128343 -1.1661916 -0.0400731 0.0247563 -0.0405661 -0.4316909 -1.0575095 -0.1678541 -0.022862 -0.1147119 -0.6205955 -0.0218019 -0.019463 -0.0225779 -0.3123664 -0.296385 0.4154846 0.0197745 0.2929141 0.2369871 0.0165508 0.0122772 0.018621 0.0301422 -0.3271964 -0.5343486 -0.0347602 0.129986 -0.2600782 -0.0047451 0.0053399 -0.0141081 -0.1478455 0.2556779 0.6164488 0.0395043 0.5783115 0.9908118 0.0616849 0.0378377 0.0628848 0.1014997 -0.1361993 0.3511194 0.0197739 -0.1075089 -0.240033 -0.0118914 -0.0076743 -0.0048909 -0.0681133 1.2227197 0.5468711 0.0464289 0.4500334 0.4687263 0.0263013 0.039969 0.027621 0.1165815 0.5405794 -0.0226533 0.0042772 0.1188865 1.2550379 0.0678034 0.0129189 0.0649371 0.1422073 -0.2575873 -0.4086546 -0.025654 -0.4185436 -0.4732014 -0.025965 -0.0262195 -0.0263673 -0.1326612 1.7386619 -0.3072999 0.0056453 -0.2844048 1.4338011 0.0719307 0.0069193 0.0709969 0.2353991 0.1649892 0.0053325 0.0002919 -0.0021795 -0.0267819 -0.0121428 -0.0005592 -0.0123219 0.1727381 0.0798705 -0.0115182 -0.0016046 -0.0386545 0.0862355 -0.0040918 -0.0032192 -0.0039198 0.1454426 0.0188426 0.0110178 -0.0013198 0.0388538 0.0672734 -0.0046147 0.00066 -0.0051066 0.155504 0.1506155 0.1572876 0.006256 0.1395334 0.4095635 0.0016182 0.0049974 0.0016403 0.4127462 0.4735038 0.0540225 0.0044445 0.0959221 0.2976624 -0.0044056 0.0064817 -0.0052885 0.389483 0.1461923 -0.0586085 -0.008019 -0.1318311 0.3444004 -0.0061181 -0.0128272 -0.0047972 0.4076934 unknown
polarizability: 144.9699748|3.3890879|147.9891063|1.707253|6.3819767|42.1558 unknown
InChI: InChI=1S/C8H6O5/c9-5-1-4(8(12)13)2-6(10)7(11)3-5/h1-3,10-12H
charge 0 multiplicity 1
19 atoms
O  1.808681 2.493127 0.139493
O  3.404518 0.533718 0.042049
O  0.546831 -3.204706 -0.217055
O  -2.923122 1.727747 0.027356
O  -3.528847 -0.503002 -0.123125
C  -1.138547 0.088067 -0.046659
C  -0.273129 1.244738 0.035757
C  1.103999 1.272281 0.05624
C  -0.797088 -1.254852 -0.121034
C  2.061749 0.165156 0.00317
C  0.52136 -1.921853 -0.141133
C  1.789993 -1.186775 -0.079199
C  -2.623023 0.356253 -0.053924
H  -0.798748 2.206477 0.086589
H  -1.632086 -1.966622 -0.176031
H  2.671858 -1.839376 -0.104698
H  1.213071 3.279862 0.180207
H  3.472731 1.526647 0.103208
H  -3.911201 1.840216 0.017989
