program: Gaussian 09
title: 000242972
version: EM64L-G09RevD.01
frameworkgroup: C1[X(C17H15N3)]
method: RPBEPBE
basis: SDD
operation: Freq
keyword: #pfreq=noraman
keyword: PBEPBE/SDD
title: #p freq=noraman PBEPBE/SDD
converged: YES YES NO NO
title: Mulliken charges:
elementType: N N N C C C C C C C C C C C C C C C C C H H H H H H H H H H H H H H H
charge: -0.222073 -0.079786 -0.039751 -0.412062 -0.413103 -0.529351 0.315307 0.177324 0.095368 -0.374003 -0.317776 0.188227 -0.261420 -0.242790 0.039358 -0.290034 -0.328108 -0.416649 -0.262501 -0.216746 0.223726 0.213874 0.267351 0.226727 0.230911 0.226156 0.232760 0.269293 0.230316 0.228597 0.270972 0.260727 0.243344 0.232143 0.233671
chargesum: 0.00000
title: Mulliken charges with hydrogens summed into heavy atoms:
elementType: N N N C C C C C C C C C C C C C C C C C
charge: -0.222073 -0.079786 -0.039751 0.025538 0.080976 -0.072284 0.315307 0.177324 0.095368 -0.141243 -0.048484 0.188227 -0.032823 -0.012474 0.039358 -0.019062 -0.067381 -0.173305 -0.030358 0.016926
polarizability: 2.86241119e+02 -6.63788761e+00 2.20727500e+02 -1.22838354e+01 1.03034322e+01 1.28041028e+02
1716.lowfreq: -9.0981 -3.4704 -0.0005 -0.0004 0.0004 3.5412 44.5494 48.7836 59.9722
frequency: 44.5039 48.7772 59.9640 99.7805 137.4658 156.7999 186.7700 234.7582 249.0289 267.4529 295.2222 346.8220 384.1757 427.3106 442.6652 456.5646 461.1706 473.6553 492.4669 518.6273 529.7562 555.7656 588.6626 605.0972 625.3830 671.6033 686.3487 713.2657 749.4517 760.6158 773.6215 793.6073 799.7520 808.8381 849.3305 868.3139 878.9492 879.7368 903.4830 935.9828 940.0662 947.0422 967.8141 980.3032 997.4561 1004.1226 1024.3427 1040.5751 1058.2740 1079.7026 1103.6470 1115.4102 1124.1126 1167.6778 1173.2211 1177.9992 1186.6375 1194.6634 1211.2062 1228.8649 1241.6500 1266.9032 1280.2007 1298.6717 1323.6975 1333.5880 1347.3091 1356.8867 1360.8520 1381.1364 1396.7714 1420.2980 1428.6609 1442.0427 1453.8164 1466.4542 1476.0289 1484.5861 1495.2680 1495.5621 1552.4770 1585.0305 1611.8070 1617.4830 2969.0668 2990.9086 2999.6433 3024.7463 3062.4505 3114.3429 3114.8917 3133.3815 3135.1373 3150.0956 3150.6816 3153.9473 3168.4354 3169.6313 3176.8433
redmass: 4.4382 4.2237 5.0474 2.7742 3.5299 4.3919 4.5975 4.6742 3.8075 4.0367 3.4191 3.2806 3.6830 3.3810 2.9033 3.6274 4.1788 4.1771 5.5769 5.4691 7.0259 4.1861 3.3822 3.3966 4.3066 4.8760 4.5719 2.7499 4.0028 1.5063 1.4088 4.1553 4.9430 4.7634 1.4748 2.0330 1.8885 1.6751 2.7375 3.3424 1.4758 1.3803 1.3742 1.3146 1.3329 3.8395 2.2737 2.3589 2.0528 1.9504 2.4166 2.3463 2.2327 1.2438 1.1519 1.3776 1.5122 1.6200 2.2572 2.4009 1.4948 1.5206 1.7079 2.3442 2.2050 1.5598 1.4995 1.7004 2.5610 6.2517 2.4981 3.1997 2.7606 2.3534 1.1414 1.1075 2.4705 1.7711 1.6367 5.0992 6.9054 6.8157 6.3607 6.3979 1.0632 1.0703 1.0633 1.0946 1.1030 1.0886 1.0943 1.0862 1.0878 1.0907 1.0917 1.0936 1.0995 1.0952 1.0988
irintensity: 2.2737 0.7654 0.3886 1.6379 1.1307 1.0300 1.2399 2.6799 2.1921 2.3806 2.0678 2.2580 0.5597 6.3585 7.1494 1.5547 9.0056 1.6098 0.7672 0.5267 2.4864 8.5278 1.4146 0.4412 12.7641 6.5051 12.0732 6.7435 11.7776 53.2862 82.5658 0.8334 7.0215 4.5910 4.0820 25.1100 21.4518 5.1285 5.8484 1.9764 13.1981 1.0675 2.9852 0.0306 0.2959 5.5509 9.6298 3.8355 12.0564 0.8029 8.1198 6.8253 43.2392 3.7511 9.1290 2.1284 33.4499 9.3073 10.5718 10.2676 6.6160 8.6111 23.9487 16.6022 55.8226 2.1214 14.8942 1.8031 53.6456 17.3719 40.2648 265.3742 120.3456 13.0283 0.7560 14.3804 256.8887 163.7502 38.6200 60.9351 75.3036 11.1056 11.1979 15.0843 27.0834 40.0029 29.4264 30.4644 52.9672 14.0174 7.5565 5.2366 5.7997 19.5910 29.1023 28.8452 14.3788 10.8696 15.8765
temp: 298.150 k
press: 1.00000 atm
elementType: 7 7 7 6 6 6 6 6 6 6 6 6 6 6 6 6 6 6 6 6 1 1 1 1 1 1 1 1 1 1 1 1 1 1 1
symmnumber: 1
zpe: 736397.6 jmol-1
zpe.correction: 0.280479 hartree
zpe.thermalcorrener: 0.295546 hartree
zpe.thermalcorrenthalpy: 0.296490 hartree
zpe.thermalcorrgfe: 0.237970 hartree
zpe.sumelectzpe: -819.689212 hartree
zpe.sumelectthermal: -819.674145 hartree
zpe.sumelectthermalent: -819.673201 hartree
zpe.sumelectthermalfe: -819.731721 hartree
dipole: -3.3273 1.5495 1.9458
dipole: 4.1542
quadrupole: -114.0529 -108.4535 -117.3111
quadrupole: 8.8253 -0.2091 -1.9754
quadrupole: -0.7804 4.8190 -4.0386 8.8253 -0.2091 -1.9754
hfenergy: -819.9696915 hartree
pointgroup: C01 [X(C17H15N3)]
dipole: 1.2668964 -0.596604 0.842788 debye
polarizability: 284.2949992|-5.3164384|220.6292804|21.8946097|-10.3183406|130.0853671 unknown
InChI: InChI=1S/C17H15N3/c1-4-10-16-13(6-1)7-5-11-20(16)17-14-8-2-3-9-15(14)18-12-19-17/h1-4,6,8-10,12H,5,7,11H2
charge 0 multiplicity 1
35 atoms
N  0.679261 1.078298 -0.001376
N  -1.248053 2.181174 -0.744056
N  -3.470637 1.181084 -0.843969
C  2.177684 2.235949 1.558439
C  1.334097 2.386747 0.277156
C  3.288933 1.184877 1.343526
C  2.840644 -0.002507 0.493612
C  1.570986 -0.032085 -0.159674
C  -0.706055 1.048431 -0.217068
C  3.724999 -1.091603 0.299493
C  1.249503 -1.114721 -1.025439
C  -1.563634 -0.071179 0.165042
C  3.389998 -2.186486 -0.523018
C  2.144378 -2.186759 -1.195894
C  -2.955371 0.040675 -0.22376
C  -1.158964 -1.198342 0.947442
C  -3.860579 -1.022672 0.0835
C  -2.596657 2.189751 -1.011754
C  -2.072438 -2.209884 1.263221
C  -3.425394 -2.134386 0.80935
H  1.507812 1.933241 2.384949
H  2.620868 3.21125 1.832458
H  0.543002 3.143035 0.378024
H  1.971734 2.677696 -0.580898
H  3.671429 0.826045 2.318257
H  4.151045 1.664378 0.836281
H  4.697875 -1.071239 0.807301
H  0.300937 -1.106951 -1.570236
H  1.876605 -3.011684 -1.865047
H  4.091435 -3.017474 -0.651885
H  -0.128609 -1.272563 1.303177
H  -4.897809 -0.911654 -0.246657
H  -2.985791 3.121638 -1.435034
H  -1.748766 -3.064975 1.866373
H  -4.125569 -2.941605 1.051064
