program: Gaussian 09
title: 000242965
version: EM64L-G09RevD.01
frameworkgroup: C1[X(C15H12N2)]
method: RPBEPBE
basis: SDD
operation: Freq
keyword: #pfreq=noraman
keyword: PBEPBE/SDD
title: #p freq=noraman PBEPBE/SDD
converged: NO YES NO NO
title: Mulliken charges:
elementType: N N C C C C C C C C C C C C C C C H H H H H H H H H H H H
charge: -0.477483 -0.071828 0.268276 0.013408 0.222456 -0.365333 -0.346385 -0.364359 -0.215568 0.484723 -0.231230 -0.284831 -0.381427 -0.399885 -0.238283 -0.236046 -0.240970 0.304190 0.232609 0.249248 0.221431 0.223728 0.267046 0.225081 0.220042 0.235802 0.225781 0.228973 0.230834
chargesum: 0.00000
title: Mulliken charges with hydrogens summed into heavy atoms:
elementType: N N C C C C C C C C C C C C C C C
charge: -0.173293 -0.071828 0.268276 0.013408 0.222456 -0.132724 -0.097137 -0.142928 0.008160 0.484723 -0.006149 -0.017784 -0.161385 -0.164083 -0.012503 -0.007073 -0.010136
polarizability: 4.37193497e+02 2.60878376e+00 1.68894484e+02 -2.49057855e-02 1.15369991e-02 6.68190996e+01
1716.lowfreq: -4.1339 -2.5493 -0.0008 -0.0008 -0.0002 2.0409 29.5560 42.0881 54.6731
frequency: 29.4834 42.0755 54.6411 99.6974 168.3455 186.5420 239.1740 250.7606 266.2296 348.0105 391.2310 402.3639 438.5676 503.4985 511.8772 519.2805 575.5644 588.3307 594.7056 612.4158 616.2607 687.0135 699.8938 729.5338 752.1471 766.5345 771.3802 825.3936 842.7136 854.2504 859.6789 875.0047 884.2843 920.1297 933.8609 975.3242 975.4163 985.0964 987.7036 987.9202 1000.4655 1008.3347 1026.0093 1083.2423 1112.4879 1159.4667 1167.2753 1173.1836 1190.6433 1217.5327 1221.8241 1254.3065 1273.2646 1303.5962 1316.9387 1332.9318 1356.1598 1387.6624 1412.2818 1432.5464 1441.0120 1475.5637 1483.0176 1517.2267 1580.6165 1589.2121 1609.9914 1630.8848 1646.7612 3104.9762 3116.0789 3122.5723 3125.7527 3130.4084 3139.4251 3142.4819 3149.1928 3158.4420 3166.2609 3172.2787 3597.0654
redmass: 3.8617 5.6074 5.0913 4.5158 5.5571 3.0680 5.9153 4.4348 2.9420 4.2341 4.6927 2.7705 2.9398 3.1099 6.7944 4.6715 2.7503 1.3077 6.3618 6.6653 6.4252 3.0164 2.1114 5.4036 1.3524 3.4984 1.9848 4.8672 1.2942 1.5024 4.5584 1.7939 6.4978 1.4653 1.3807 1.3592 1.3197 5.2948 1.2433 6.0032 1.2747 2.2453 2.1965 1.6111 1.5685 1.1651 1.6519 1.0896 1.1396 1.7177 2.6815 1.9185 3.0741 1.5865 1.7930 1.3885 2.6566 5.7115 2.7344 3.5852 2.3534 3.6290 2.3614 4.5482 5.6943 6.7419 5.9245 7.4007 5.6437 1.0930 1.0868 1.0854 1.0870 1.0854 1.0914 1.0905 1.0963 1.0958 1.1015 1.0991 1.0811
irintensity: 1.7293 0.7957 0.2898 0.3379 0.2475 1.1884 1.1786 1.9788 5.2719 0.1938 1.8003 0.0525 16.1368 8.2121 10.7186 14.8571 13.3591 70.0260 2.6132 1.7544 0.1086 5.2685 59.5627 1.5909 87.8631 0.8095 88.7469 1.4579 0.4631 0.2070 2.9723 9.0185 2.2891 0.0835 4.5250 1.5442 0.1178 0.2042 31.5622 0.0144 23.8899 11.5348 5.3564 11.3433 4.1043 1.9128 8.9803 0.2110 1.0314 2.0234 4.2724 30.2478 18.1833 0.6747 24.6610 7.2870 37.6182 7.3173 17.4054 2.9067 7.1645 6.2429 9.5925 58.3934 4.4076 3.8018 7.0559 1.7715 14.6012 6.3868 19.7471 10.8696 1.8506 0.1794 4.5168 12.2878 44.1041 31.2540 40.9499 29.1750 34.9459
temp: 298.150 k
press: 1.00000 atm
elementType: 7 7 6 6 6 6 6 6 6 6 6 6 6 6 6 6 6 1 1 1 1 1 1 1 1 1 1 1 1
symmnumber: 1
zpe: 599817.8 jmol-1
zpe.correction: 0.228459 hartree
zpe.thermalcorrener: 0.241609 hartree
zpe.thermalcorrenthalpy: 0.242553 hartree
zpe.thermalcorrgfe: 0.187138 hartree
zpe.sumelectzpe: -687.149627 hartree
zpe.sumelectthermal: -687.136476 hartree
zpe.sumelectthermalent: -687.135532 hartree
zpe.sumelectthermalfe: -687.190947 hartree
dipole: 0.7924 -3.2556 0.0169
dipole: 3.3506
quadrupole: -81.5374 -83.2199 -107.5833
quadrupole: 4.3573 -0.0203 0.0113
quadrupole: 9.2428 7.5603 -16.8031 4.3573 -0.0203 0.0113
hfenergy: -687.3780852 hartree
pointgroup: C01 [X(C15H12N2)]
dipole: 0.3159763 1.2794503 0.0304194 debye
polarizability: 437.1686813|-3.5283306|168.8340798|1.2232643|2.8656938|66.9043198 unknown
InChI: InChI=1S/C15H12N2/c1-2-6-12(7-3-1)10-11-15-16-13-8-4-5-9-14(13)17-15/h1-11,16H
charge 0 multiplicity 1
29 atoms
N  -1.796908 1.404671 0.016799
N  -1.407334 -0.848433 -0.036655
C  -3.06199 0.806481 -0.005373
C  -2.792783 -0.609978 -0.03846
C  -0.828409 0.3769 -0.006024
C  -4.37129 1.329122 0.000598
C  -3.869881 -1.52807 -0.066338
C  0.594788 0.664423 0.007234
C  -5.428288 0.393728 -0.027735
C  3.005277 -0.148812 -0.008557
C  -5.180933 -1.01148 -0.060608
C  1.548084 -0.321662 -0.017321
C  3.649503 1.12394 0.034877
C  3.828084 -1.313008 -0.044673
C  5.053677 1.222632 0.041952
C  5.234679 -1.214708 -0.037821
C  5.855899 0.054787 0.005694
H  -1.6014 2.40365 0.041441
H  -4.571221 2.405463 0.026051
H  -3.67461 -2.604192 -0.091341
H  0.879086 1.724675 0.038756
H  -6.462826 0.754263 -0.024205
H  1.175563 -1.35514 -0.047269
H  -6.032506 -1.70025 -0.081649
H  3.050462 2.041151 0.062781
H  3.349946 -2.29956 -0.078617
H  5.529898 2.209075 0.075569
H  5.845112 -2.124008 -0.065626
H  6.948318 0.136445 0.010821
