program: Gaussian 09
title: 000242953
version: EM64L-G09RevD.01
frameworkgroup: C1[X(C10H10N2O2)]
method: RPBEPBE
basis: SDD
operation: Freq
keyword: #p
keyword: freq=noraman
keyword: PBEPBE/SDD
title: #p freq=noraman PBEPBE/SDD
converged: YES YES NO NO
title: Mulliken charges:
elementType: O O N N C C C C C C C C C C H H H H H H H H H H
charge: -0.192394 -0.241807 -0.186304 -0.400230 -0.317658 0.522481 0.160548 0.209084 -0.618953 -0.414350 -0.373872 -0.220198 -0.228065 -0.236855 0.263134 0.350375 0.230417 0.248407 0.267183 0.235649 0.249372 0.230372 0.230604 0.233058
chargesum: 0.00000
title: Mulliken charges with hydrogens summed into heavy atoms:
elementType: O O N N C C C C C C C C C C
charge: -0.192394 -0.241807 -0.186304 -0.049855 -0.054524 0.522481 0.160548 0.209084 0.127053 -0.178701 -0.124500 0.010174 0.002539 -0.003796
polarizability: 1.57704522e+02 6.46247002e+00 1.05163415e+02 8.32815857e+00 1.28606122e+01 9.61865245e+01
1716.lowfreq: -8.5086 -5.8826 -0.0011 -0.0007 0.0000 5.9787 33.2962 58.8326 79.2165
frequency: 33.1059 58.8056 79.1974 124.5008 141.5110 185.2729 235.0526 242.7535 255.3281 327.4886 377.0518 404.1059 484.0842 510.1756 556.7400 600.8701 614.6899 645.5079 675.7111 685.3014 706.1537 716.3678 762.7984 820.8630 847.3536 857.7487 897.7793 938.2302 982.2863 990.6554 1000.8931 1017.0849 1029.8772 1085.8373 1110.0175 1129.8049 1174.6906 1187.7856 1198.8150 1200.7277 1256.0334 1262.3219 1275.7768 1311.2612 1335.9023 1377.7452 1390.5405 1432.3639 1445.5194 1475.3435 1483.0879 1493.3453 1597.9325 1613.0019 1684.1220 1711.2745 2974.6234 2977.0073 3057.0607 3107.4367 3123.5576 3125.5288 3138.1839 3150.2054 3166.8784 3590.4225
redmass: 4.1957 6.7055 4.7239 4.0127 1.0739 6.2127 4.9809 4.4963 3.4635 6.3659 8.4044 2.8283 3.6487 3.8075 7.2876 5.9990 6.3587 1.3981 4.5464 5.6231 1.9042 5.2474 1.9578 4.4955 3.7781 1.2515 2.9101 1.6963 1.3949 6.0046 1.3267 2.3115 1.9925 1.5758 3.9071 1.3046 1.0583 1.1195 1.6775 1.9244 5.7791 3.3171 1.7285 1.6769 1.3345 4.5154 4.8885 1.2390 2.0616 1.0430 2.2670 1.0999 6.1618 6.0806 7.9432 11.2785 1.0641 1.0538 1.1006 1.0991 1.0857 1.0883 1.0914 1.0961 1.1015 1.0803
irintensity: 0.4195 0.0569 0.7913 0.1306 0.0397 10.8730 2.4089 4.0494 1.7802 9.9327 13.8228 0.1722 15.6214 1.7765 12.8019 17.9938 0.2964 103.7238 5.4833 5.6580 51.9487 50.8942 40.1603 5.1137 1.0573 0.0923 9.1742 6.5374 0.0076 0.9396 0.5094 42.5058 6.1546 6.8829 74.0662 0.2076 0.2807 2.1516 34.3346 16.5642 108.4983 14.2150 41.4761 16.1417 6.4253 106.2122 34.2036 56.0415 41.0953 15.8322 14.0372 5.7678 0.9725 5.2213 633.7531 238.5525 25.2644 42.4169 26.7341 2.5642 4.6833 1.4644 9.2918 31.9380 20.9597 72.5942
temp: 298.150 k
press: 1.00000 atm
elementType: 8 8 7 7 6 6 6 6 6 6 6 6 6 6 1 1 1 1 1 1 1 1 1 1
symmnumber: 1
zpe: 487176.2 jmol-1
zpe.correction: 0.185556 hartree
zpe.thermalcorrener: 0.197665 hartree
zpe.thermalcorrenthalpy: 0.198609 hartree
zpe.thermalcorrgfe: 0.146174 hartree
zpe.sumelectzpe: -646.046446 hartree
zpe.sumelectthermal: -646.034337 hartree
zpe.sumelectthermalent: -646.033392 hartree
zpe.sumelectthermalfe: -646.085828 hartree
dipole: 2.4322 -1.7446 1.5464
dipole: 3.3691
quadrupole: -83.6012 -89.2731 -74.7813
quadrupole: -7.0219 -2.3454 0.3054
quadrupole: -1.0494 -6.7212 7.7706 -7.0219 -2.3454 0.3054
hfenergy: -646.2320017 hartree
pointgroup: C01 [X(C10H10N2O2)]
dipole: -0.9557374 -0.9130899 -0.0989084 debye
dipolederiv: -0.5176816 0.1653488 -0.1503358 0.075265 -0.9344276 0.3853743 -0.1577322 0.3273949 -0.5657602 -1.1403102 0.0100032 -0.361563 0.1683957 -0.544553 0.1441588 -0.5413455 0.0624648 -0.6206727 -1.0180092 -0.3354283 -0.1325951 -0.1792049 -0.7876793 -0.0173912 -0.1632833 -0.0448249 -0.377722 -0.8932137 0.4315248 -0.3645516 0.0834052 -0.9052837 0.2954484 -0.3707131 0.455108 -0.6647746 0.3815645 -0.3001205 0.0386043 -0.5273299 -0.1465717 0.049655 0.0930404 -0.0037894 0.3655406 0.2492123 0.1086376 -0.0794449 0.0818888 -0.0841389 0.00897 -0.0751483 -0.0050944 -0.0524675 1.0245164 -0.3248446 0.5648022 0.2630529 1.0586999 -0.4483513 0.5380778 -0.5102761 0.6994236 1.6546716 0.2396144 0.6189464 0.0456757 1.4472402 -0.3777563 0.8424623 -0.2190322 0.7374966 0.0764546 0.0516872 -0.0829382 0.0206188 0.5310935 0.0446185 -0.162535 -0.0065987 0.1688452 -0.141125 -0.0109524 -0.0379555 0.0268121 -0.1286925 -0.0313008 0.0286537 0.0086535 0.0905855 -0.0972142 -0.0249109 0.0872614 -0.0277215 -0.1298934 0.005146 0.0669589 0.0127089 -0.0427473 0.0523484 -0.0040706 0.1044974 -0.0134065 -0.1306221 0.0003914 0.1064658 0.0085918 0.0171797 -0.0385943 -0.0008276 -0.0372297 0.0009576 -0.1413429 0.0144458 -0.0437336 0.0133366 0.1360755 0.0716567 -0.014788 -0.0552688 -0.0150937 -0.157859 0.007324 -0.0576957 0.0010603 -0.0453091 0.0188674 0.0129196 -0.0433823 0.0350464 0.0455208 -0.0497453 -0.0227702 -0.0322076 -0.0960085 0.241494 0.0048917 -0.0698432 0.0327301 0.2093552 0.0557338 -0.1164689 0.048671 0.2935421 0.1049858 -0.0111519 0.010657 -0.0167507 -0.0651231 -0.0536899 0.0439828 -0.156451 -0.0834289 -0.0491784 -0.1065747 0.1028147 -0.0614559 0.0296011 -0.0107987 0.1053887 0.021949 0.0510686 0.0309337 0.0869523 -0.0820435 -0.0043613 0.0943317 -0.0037793 -0.0669558 0.0548118 0.0679259 0.0867345 0.0110294 0.0689429 0.0049094 0.1380804 -0.0057318 0.0438561 -0.0148029 -0.0791984 -0.0028199 0.0024158 -0.100024 -0.0137105 0.1338239 0.0041212 -0.1094174 -0.0025566 0.0374262 -0.0521621 -0.0021444 -0.0961071 0.0056776 0.155337 -0.0047623 -0.1054601 -0.0042654 0.0029975 0.0639233 0.0030402 0.030516 0.0074582 0.1533281 -0.0079574 0.0541791 -0.0103219 -0.1074382 -0.1070546 0.007749 0.0662403 0.0071414 0.1597754 -0.0041231 0.0701933 -0.0045297 0.0674204 unknown
polarizability: 157.3006683|-0.135462|89.6976665|11.374951|-8.0739998|112.0561269 unknown
InChI: InChI=1S/C10H10N2O2/c1-12-8(9(13)11-10(12)14)7-5-3-2-4-6-7/h2-6,8,11H,1H3
charge 0 multiplicity 1
24 atoms
O  0.682854 2.253347 -1.57486
O  3.497013 -0.426117 1.10289
N  1.462772 -0.898838 -0.045783
N  2.27036 1.200434 -0.156034
C  0.499044 -0.166229 -0.887814
C  -0.933933 -0.156945 -0.356952
C  1.121994 1.265611 -0.945766
C  2.517055 -0.103452 0.388207
C  1.376597 -2.331086 0.232557
C  -2.017689 -0.166517 -1.266011
C  -1.19139 -0.094472 1.035001
C  -3.347195 -0.112391 -0.791067
C  -2.519753 -0.045779 1.509915
C  -3.601599 -0.053744 0.598255
H  0.496239 -0.564636 -1.923675
H  2.90336 1.981869 0.014527
H  1.46747 -2.9258 -0.696409
H  0.417803 -2.579959 0.721554
H  2.206856 -2.59674 0.906941
H  -1.822937 -0.20537 -2.344489
H  -0.353767 -0.086445 1.742894
H  -4.180738 -0.116952 -1.501824
H  -2.711842 0.001272 2.587539
H  -4.632271 -0.01466 0.967606
