program: Gaussian 09
title: 000242986
version: EM64L-G09RevD.01
frameworkgroup: C1[X(C18H14Cl3N2OPS)]
method: RPBEPBE
basis: SDD
operation: Freq
keyword: #p
keyword: freq=noraman
keyword: PBEPBE/SDD
title: #p freq=noraman PBEPBE/SDD
converged: YES YES NO NO
title: Mulliken charges:
elementType: Cl Cl Cl S P O N N C C C C C C C C C C C C C C C C C C H H H H H H H H H H H H H H
charge: 0.008847 0.001772 0.007466 -0.115630 0.761353 -0.426609 -0.829855 -0.849259 0.534924 0.547522 0.526460 -0.429749 -0.421426 -0.347854 -0.325535 -0.346301 -0.221691 -0.192055 -0.196904 -0.219390 -0.215156 -0.255675 -0.253689 -0.099030 -0.193740 -0.106563 0.335451 0.349761 0.220200 0.222853 0.293534 0.269110 0.297387 0.228947 0.228232 0.231476 0.230550 0.232725 0.231660 0.285881
chargesum: 0.00000
title: Mulliken charges with hydrogens summed into heavy atoms:
elementType: Cl Cl Cl S P O N N C C C C C C C C C C C C C C C C C C
charge: 0.008847 0.001772 0.007466 -0.115630 0.761353 -0.426609 -0.494404 -0.499498 0.534924 0.547522 0.526460 -0.209549 -0.198572 -0.054319 -0.056426 -0.346301 0.075696 0.036893 0.031328 0.012085 0.015394 -0.022950 -0.022030 -0.099030 0.092141 -0.106563
polarizability: 3.70566443e+02 2.03595222e+01 2.78564658e+02 -2.86692218e+01 2.66619656e+01 2.27305775e+02
1716.lowfreq: -8.1578 -6.9205 -4.8556 -0.0028 -0.0028 -0.0018 5.1714 14.7573 21.7293
frequency: -4.9396 14.4489 21.6471 30.8737 31.7154 40.5451 45.2498 65.6233 77.7982 107.8314 131.6967 137.5843 143.9515 178.3427 182.0389 189.4881 197.4166 200.6202 228.3040 268.0638 288.6964 297.6281 306.7927 314.0989 348.3556 401.2813 404.4975 409.5762 414.1477 442.9304 449.9368 475.5843 493.6147 499.8875 516.9408 534.7693 545.2537 563.9077 592.7000 607.2837 611.8752 616.2165 622.0024 653.9819 691.5682 693.8536 697.3812 721.4655 741.0359 760.8828 765.7259 802.7198 828.8578 829.6839 852.2144 872.9161 873.9161 879.5168 899.7044 901.6546 908.4879 965.5670 965.7682 984.2792 986.0786 989.3876 989.7550 1027.8468 1028.7595 1033.5982 1088.8495 1091.2884 1110.1174 1172.7453 1173.2019 1192.4188 1195.4329 1203.0769 1232.8302 1239.1700 1249.4379 1296.9094 1315.7465 1318.7484 1355.8611 1357.1076 1367.1513 1396.9329 1407.5059 1435.4640 1461.3108 1468.6307 1483.6653 1487.4357 1547.7798 1570.3118 1597.1136 1599.3206 1612.7383 1615.1522 3115.3495 3116.3523 3134.9789 3135.6962 3146.1283 3146.1804 3161.2745 3162.9955 3172.7692 3173.7180 3178.8940 3182.0869 3506.3625 3514.2591
redmass: 9.4926 6.0991 5.2229 5.3366 5.9129 6.1294 10.2553 9.7308 11.8442 8.1250 10.5674 9.3785 7.3214 14.6390 7.5473 7.4666 5.5612 9.7438 5.6906 6.4942 5.2827 5.9013 8.4061 11.4643 10.2951 2.9322 2.9433 8.7955 3.9463 3.6389 2.6166 3.7640 2.1630 6.9465 2.8663 1.6925 7.5201 7.9139 5.6507 6.3624 6.4419 6.8445 8.9072 8.0321 1.9463 1.9153 3.5612 8.5383 4.3094 1.7300 1.8938 4.7730 1.2717 1.2968 1.4933 1.5123 4.8324 7.6001 1.4721 2.3509 2.3644 1.3753 1.3783 5.9679 5.6117 1.3483 1.3244 2.1390 2.1589 6.0325 1.5671 1.5748 1.7965 1.0499 1.0500 1.1133 1.1157 5.9217 1.2390 2.2143 2.0864 1.7022 8.6677 1.5832 1.4873 10.3692 2.2607 3.9271 2.5208 2.9529 2.1063 1.9466 2.3376 2.4454 9.7553 8.1085 5.9520 5.8442 6.0773 6.1074 1.0883 1.0881 1.0867 1.0866 1.0927 1.0929 1.0951 1.0958 1.1010 1.1003 1.0928 1.0933 1.0749 1.0752
irintensity: 0.0601 0.0567 0.2101 0.0724 0.0542 0.0658 0.1619 0.1995 0.5100 2.4919 0.8811 0.3164 0.9787 0.4123 0.9061 0.8961 4.1964 1.3507 3.7815 7.1234 0.3106 0.2666 3.7782 1.7906 10.6826 1.1243 1.8474 2.4593 11.8225 62.6607 87.9932 37.8710 13.0058 8.6390 5.2890 17.4477 31.9043 41.8621 10.7899 52.3707 8.3853 13.6407 2.0011 90.6860 23.1096 50.9432 4.0652 124.4701 31.8757 38.7116 202.4799 39.6809 2.0381 1.9913 4.1296 16.9223 216.5776 55.3800 15.7166 35.9505 41.3663 0.3739 0.3681 0.4519 0.3329 0.1427 1.9095 30.1579 12.9879 111.9198 11.8217 19.2790 71.2433 0.3097 0.8115 1.6070 2.2777 59.8946 9.3926 132.9150 6.2246 266.9599 59.8646 5.7948 97.7322 14.6512 6.3459 28.1780 0.2539 242.4980 24.3317 11.3385 251.1220 4.4471 2.4034 3.2682 0.6669 8.4334 185.3772 4.1427 12.3888 10.4763 0.0646 0.0425 10.2384 37.1465 15.8985 21.3450 18.5876 9.6911 10.0635 0.0670 10.0607 26.5958
temp: 298.150 k
press: 1.00000 atm
elementType: 17 17 17 16 15 8 7 7 6 6 6 6 6 6 6 6 6 6 6 6 6 6 6 6 6 6 1 1 1 1 1 1 1 1 1 1 1 1 1 1
symmnumber: 1
zpe: 729054.1 jmol-1
zpe.correction: 0.277682 hartree
zpe.thermalcorrener: 0.302109 hartree
zpe.thermalcorrenthalpy: 0.303054 hartree
zpe.thermalcorrgfe: 0.219773 hartree
zpe.sumelectzpe: -2996.671158 hartree
zpe.sumelectthermal: -2996.646731 hartree
zpe.sumelectthermalent: -2996.645787 hartree
zpe.sumelectthermalfe: -2996.729068 hartree
dipole: -0.0436 0.1434 3.7879
dipole: 3.7909
quadrupole: -176.6392 -197.3467 -177.2270
quadrupole: 16.6243 3.9886 -8.1015
quadrupole: 7.0984 -13.6091 6.5107 16.6243 3.9886 -8.1015
hfenergy: -2996.9488403 hartree
pointgroup: C01[X(C18H14Cl3N2O1P1S1)]
dipole: 0.1313226 -0.1668303 1.4762567 debye
polarizability: 363.7863986|-20.6434158|269.5774631|-26.8578507|45.2118908|243.0730144 unknown
InChI: InChI=1S/C18H14Cl3N2OPS/c19-15-11-17(21)18(12-16(15)20)24-25(26,22-13-7-3-1-4-8-13)23-14-9-5-2-6-10-14/h1-12,22-23H
charge 0 multiplicity 1
40 atoms
Cl 2.25828 1.353478 -2.406239
Cl -1.805614 3.889092 1.875371
Cl 0.905625 5.522981 0.964303
S  -0.2300 -2.942276 -1.933981
P  -0.189036 -1.457821 -0.527448
O  -0.334605 0.115955 -1.42218
N  -1.4562 -1.32649 0.677571
N  1.137897 -1.30387 0.579688
C  -2.851943 -1.161898 0.426816
C  2.499178 -1.719334 0.434555
C  -0.040582 1.342379 -0.811183
C  -3.756285 -1.39413 1.497508
C  3.293626 -1.782235 1.609831
C  -3.35073 -0.763101 -0.841526
C  3.069012 -2.048987 -0.820243
C  1.120731 2.061541 -1.196901
C  -0.923865 1.923063 0.1315
C  -5.141807 -1.218208 1.303932
C  4.647325 -2.169086 1.527952
C  -4.741246 -0.598516 -1.020352
C  4.419507 -2.454338 -0.883974
C  -5.644752 -0.82007 0.043636
C  5.217322 -2.515369 0.281164
C  -0.644103 3.18966 0.678137
C  1.397319 3.331962 -0.659424
C  0.51443 3.894935 0.285619
H  -1.226235 -1.767492 1.573826
H  0.935163 -0.744815 1.414892
H  -3.376079 -1.708513 2.477973
H  2.851901 -1.534665 2.583415
H  -2.668097 -0.58774 -1.678284
H  2.471366 -1.986589 -1.733735
H  -1.837491 1.391528 0.408816
H  -5.82786 -1.397859 2.139005
H  5.252169 -2.20785 2.440656
H  -5.117202 -0.295183 -2.003616
H  4.851243 -2.71135 -1.857424
H  -6.721088 -0.688342 -0.106328
H  6.266177 -2.823231 0.219038
H  2.291048 3.879884 -0.967961
