program: Gaussian 09
title: 000242979
version: EM64L-G09RevD.01
frameworkgroup: C1[X(C23H19ClN2O)]
method: RPBEPBE
basis: SDD
operation: Freq
keyword: #p
keyword: freq=noraman
keyword: PBEPBE/SDD
title: #p freq=noraman PBEPBE/SDD
converged: YES YES NO NO
title: Mulliken charges:
elementType: Cl O N N C C C C C C C C C C C C C C C C C C C C C C C H H H H H H H H H H H H H H H H H H H
charge: -0.056195 -0.261375 -0.290323 -0.026823 -0.402751 -0.422524 -0.541103 0.210707 0.314991 0.256247 0.291749 0.218411 -0.346076 -0.387274 -0.140632 -0.083156 -0.488989 -0.239441 -0.267447 -0.316341 -0.314511 -0.290609 0.303573 -0.271904 -0.360208 -0.117359 -0.536891 0.241213 0.209963 0.228666 0.210237 0.231290 0.221740 0.258866 0.228485 0.287189 0.225464 0.225333 0.248353 0.265089 0.288449 0.255178 0.247681 0.223004 0.221735 0.248320
chargesum: 0.00000
title: Mulliken charges with hydrogens summed into heavy atoms:
elementType: Cl O N N C C C C C C C C C C C C C C C C C C C C C C C
charge: -0.056195 -0.261375 -0.290323 -0.026823 0.048425 0.016379 -0.088074 0.210707 0.314991 0.256247 0.291749 0.218411 -0.087210 -0.158789 -0.140632 -0.083156 -0.201799 -0.013977 -0.042114 -0.067988 -0.049421 -0.002160 0.303573 -0.016727 -0.112527 -0.117359 0.156168
polarizability: 4.49181157e+02 1.17012907e+01 3.28709472e+02 5.67539023e+00 7.22404506e+00 1.83420107e+02
1716.lowfreq: -3.0769 0.0011 0.0012 0.0018 5.0223 9.0681 26.6755 40.1585 43.2452
frequency: 26.6585 40.1484 43.1966 49.7715 79.9681 97.2694 102.9357 120.6452 122.4665 135.7914 183.4047 194.9629 218.2588 222.7704 243.8519 262.5835 265.2190 284.7700 305.2239 334.1176 363.0525 383.0455 401.2411 407.5090 426.3266 439.5473 443.1621 465.7969 476.4420 481.2031 523.8009 531.0089 549.7447 563.9564 588.5335 609.2261 616.4449 634.1118 657.0793 670.6703 687.0894 715.5971 727.8219 734.6240 747.9763 757.4680 778.1810 803.0251 814.8032 830.2720 849.4458 852.8222 876.2705 878.3430 890.4855 894.5843 908.2774 929.1690 943.4136 949.0863 958.0876 966.4740 976.3771 1004.1735 1021.4272 1038.8280 1053.8259 1058.6840 1077.0208 1109.6639 1113.0768 1125.4771 1134.2036 1144.0464 1162.3929 1172.0701 1184.3742 1189.5447 1201.8762 1211.0108 1219.6287 1242.7352 1249.0166 1260.5126 1282.7613 1289.5155 1301.5468 1324.2692 1335.0886 1347.2609 1360.3408 1376.3591 1382.1593 1385.9851 1416.7603 1426.8665 1435.3714 1443.9857 1451.8925 1455.9468 1465.6296 1470.1326 1472.4139 1477.0476 1482.2838 1492.5323 1517.5930 1529.7915 1539.8069 1584.0441 1599.6389 1613.3250 1634.1035 2948.0945 2962.7295 2963.4090 2998.4659 3028.7287 3052.7327 3062.0709 3079.9994 3112.2834 3126.3836 3130.3795 3147.1650 3151.2467 3154.9419 3163.9681 3172.7580 3176.8283 3177.7438 3182.9262
redmass: 5.4696 4.5166 5.2305 4.5163 4.2029 3.2402 4.2363 4.8786 4.6312 4.1078 4.3567 5.1147 2.0893 3.0973 3.5320 4.7792 3.1283 3.3859 3.2938 3.2919 4.7238 4.4158 6.0251 4.8954 4.1604 4.5004 3.2453 3.5483 3.1792 4.8055 4.7887 5.1291 4.3029 3.7051 4.0244 4.3862 3.9551 7.5824 5.2421 5.5285 6.4492 2.7760 5.1555 3.4592 5.5002 1.4516 1.9681 4.0092 1.6817 2.1615 3.2632 1.5075 1.6105 1.6969 1.5535 4.1848 2.8427 2.8506 1.3862 5.8702 1.3169 1.3368 1.3115 3.3133 3.5497 2.3193 2.1194 2.2205 1.8969 1.2555 2.3041 1.6364 1.7265 1.4886 1.2843 1.0930 1.5503 1.4316 2.1962 1.5915 2.2229 2.8491 1.6252 1.6136 1.9057 2.3006 2.1941 2.3276 1.5364 1.4475 1.7119 2.5011 5.0814 4.7517 4.6212 6.2353 1.4416 2.2479 2.1675 1.2661 1.1124 1.0507 1.0975 1.2862 2.6963 2.2382 7.1927 8.6671 8.4952 6.8589 6.8854 6.4460 7.0204 1.0696 1.0335 1.0645 1.0619 1.0939 1.1043 1.1032 1.0949 1.0880 1.0994 1.0871 1.0932 1.0869 1.0868 1.1005 1.0969 1.0969 1.0916 1.0934
irintensity: 1.2644 0.9925 0.5269 0.0586 3.7427 4.9101 1.0576 2.2148 0.8831 0.9678 1.5953 2.3645 0.3985 0.1153 5.5940 2.3893 3.3903 3.1992 1.1154 5.6686 0.6487 1.8605 2.9462 6.7922 9.5232 5.9127 9.0907 3.9617 1.8267 2.3739 2.3896 25.9664 7.5508 18.7943 0.3612 0.8203 16.9730 1.0426 0.3197 7.9569 1.2109 7.2183 2.1444 2.0124 11.4427 70.0205 2.8376 25.9782 69.3520 13.4798 9.2399 1.9621 2.1487 22.0177 15.5625 48.9234 12.0120 42.5402 2.0940 31.7766 1.3534 1.2863 0.1255 68.6760 3.9776 4.7866 37.7123 11.1803 2.3199 0.1381 30.0408 11.4814 37.2578 11.5191 7.0816 3.3638 61.6482 32.0628 194.9856 17.2688 38.9716 2.4804 7.1127 37.6147 50.2247 10.7494 50.7070 12.9825 3.5615 5.4718 50.4668 68.8891 6.3367 33.0031 33.1590 153.8681 62.9482 17.7519 77.4429 5.6439 13.9452 13.2001 65.3794 11.8268 53.1147 154.2850 61.7243 17.0167 68.7055 28.0510 30.8739 32.8956 190.0548 47.1370 114.6950 30.1029 26.8413 32.3904 43.2996 45.8111 17.7949 18.9422 22.8447 5.8162 25.9572 3.3750 1.2999 26.1600 13.2082 7.9813 7.1318 2.4013
temp: 298.150 k
press: 1.00000 atm
elementType: 17 8 7 7 6 6 6 6 6 6 6 6 6 6 6 6 6 6 6 6 6 6 6 6 6 6 6 1 1 1 1 1 1 1 1 1 1 1 1 1 1 1 1 1 1 1
symmnumber: 1
zpe: 943234.6 jmol-1
zpe.correction: 0.359259 hartree
zpe.thermalcorrener: 0.381437 hartree
zpe.thermalcorrenthalpy: 0.382381 hartree
zpe.thermalcorrgfe: 0.307531 hartree
zpe.sumelectzpe: -1530.765616 hartree
zpe.sumelectthermal: -1530.743438 hartree
zpe.sumelectthermalent: -1530.742494 hartree
zpe.sumelectthermalfe: -1530.817344 hartree
dipole: 4.7030 -0.1783 -1.6688
dipole: 4.9935
quadrupole: -169.5866 -141.5173 -160.6074
quadrupole: 13.7543 -0.1002 6.0180
quadrupole: -12.3495 15.7198 -3.3703 13.7543 -0.1002 6.0180
hfenergy: -1531.1248747 hartree
pointgroup: C01 [X(C23H19Cl1N2O1)]
dipole: 1.9090074 0.0836844 -0.4563386 debye
polarizability: 444.2737949|9.2303529|321.8097652|34.443617|33.9241389|195.2271758 unknown
InChI: InChI=1S/C23H19ClN2O/c1-27-17-9-11-20-19(14-17)23(18-10-8-16(24)13-21(18)25-20)26-12-4-6-15-5-2-3-7-22(15)26/h2-3,5,7-11,13-14H,4,6,12H2,1H3
charge 0 multiplicity 1
46 atoms
Cl -6.583087 -0.34775 -0.520237
O  3.429005 2.764323 0.418744
N  0.293974 -1.17913 -0.719573
N  -2.164911 2.232352 0.298182
C  0.201035 -1.68136 -2.115651
C  1.611241 -1.751072 -2.736262
C  2.472218 -2.748049 -1.932209
C  1.274294 -1.764066 0.130433
C  2.335362 -2.546793 -0.424628
C  -0.501647 -0.062569 -0.325384
C  0.097671 1.190476 0.050692
C  -1.927695 -0.154921 -0.366442
C  1.183667 -1.606715 1.542626
C  3.269146 -3.141429 0.455969
C  -0.79684 2.302702 0.368929
C  -2.71893 1.036507 -0.066423
C  1.509592 1.412043 0.078204
C  2.132504 -2.201498 2.394023
C  3.185569 -2.978993 1.855133
C  -2.623506 -1.384293 -0.644654
C  -0.219049 3.563458 0.744501
C  -4.156534 0.962645 -0.131424
C  2.030606 2.658477 0.435559
C  -4.013178 -1.4394 -0.682462
C  1.157831 3.74862 0.785911
C  -4.762635 -0.242882 -0.439506
C  4.032938 4.046011 0.794633
H  -0.45228 -0.999383 -2.683618
H  -0.255293 -2.693971 -2.140457
H  2.062415 -0.741272 -2.719175
H  1.538176 -2.068842 -3.79303
H  3.535455 -2.660223 -2.225047
H  2.165264 -3.78227 -2.192513
H  0.358856 -1.022986 1.963926
H  4.085537 -3.737114 0.027054
H  2.206401 0.6084 -0.168741
H  2.043491 -2.066836 3.477772
H  3.925073 -3.447558 2.51288
H  -2.044078 -2.299123 -0.798335
H  -0.913343 4.372553 0.989847
H  -4.723712 1.872474 0.078348
H  -4.537111 -2.379058 -0.878769
H  1.566883 4.721107 1.075271
H  3.778982 4.323791 1.835761
H  3.726672 4.856564 0.105359
H  5.117273 3.882252 0.711786
