program: Gaussian 09
title: 000020498
version: EM64L-G09RevD.01
frameworkgroup: C1[X(C7H14O3)]
method: RPBEPBE
basis: SDD
operation: Freq
keyword: #pfreq=noraman
keyword: PBEPBE/SDD
title: #p freq=noraman PBEPBE/SDD
converged: YES YES NO NO
title: Mulliken charges:
elementType: O O O C C C C C C C H H H H H H H H H H H H H H
charge: -0.293991 -0.260240 -0.250893 0.055650 -0.416041 -0.267637 -0.713130 -0.506116 0.286110 -0.752540 0.172792 0.225917 0.204540 0.214775 0.263199 0.218123 0.229159 0.215177 0.198211 0.235299 0.205170 0.245271 0.247297 0.243899
chargesum: 0.00000
title: Mulliken charges with hydrogens summed into heavy atoms:
elementType: O O O C C C C C C C
charge: -0.293991 -0.260240 -0.250893 0.228442 0.014416 0.210337 -0.050672 0.132563 0.286110 -0.016073
polarizability: 1.08006418e+02 7.52304167e-01 8.60313461e+01 8.90564405e-01 2.26443313e+00 6.76686762e+01
1716.lowfreq: -38.7316 -4.4652 -0.0005 0.0006 0.0007 6.6365 9.4585 30.2199 46.0958
frequency: -38.6241 30.0920 45.8677 62.7153 93.7300 112.4963 176.9344 185.4413 200.1128 234.9876 247.7972 284.8572 372.8454 413.1786 469.6240 514.4237 566.6440 615.7023 740.0290 807.1436 829.8132 915.3478 936.7985 959.0832 1002.7970 1020.1601 1041.4643 1061.8373 1097.2470 1112.1432 1120.2617 1140.6975 1156.3302 1208.5116 1209.8809 1273.5993 1280.9495 1327.5600 1345.3110 1375.2643 1381.0481 1384.1909 1434.7692 1451.3141 1453.5143 1455.3643 1456.3061 1465.6461 1479.2581 1479.9074 1484.2507 1649.2531 2905.3138 2930.8905 2984.5576 3005.9169 3007.4274 3009.5373 3012.0933 3064.7926 3079.1881 3089.6789 3095.7121 3099.1364 3099.7610 3142.5872
redmass: 1.0515 5.9954 3.0402 2.6683 2.5263 2.5533 2.0504 1.3759 1.5865 2.4293 2.6648 2.9282 3.1190 3.1001 2.8336 2.8196 2.9979 4.7847 2.1564 1.3977 5.5900 1.7291 4.4744 1.5430 2.0943 3.8258 1.6668 4.1021 1.7570 1.3389 2.2606 1.9162 1.3785 2.4350 1.7216 1.1428 1.2970 1.2073 1.4031 1.4522 1.2391 1.3768 1.1322 1.0848 1.0638 1.0481 1.0564 1.0578 1.0494 1.0577 1.0783 9.2195 1.0833 1.0352 1.0362 1.0609 1.0369 1.0964 1.0638 1.1004 1.0986 1.1004 1.0974 1.0980 1.1046 1.1009
irintensity: 1.2161 1.2284 0.6979 4.9152 2.4659 0.6554 4.7671 0.9606 2.4813 7.6700 7.2843 4.3907 8.3388 8.2848 2.8050 1.2172 2.7566 3.9611 5.5374 6.3837 10.7084 9.8907 43.8560 2.1822 106.9242 19.1318 8.7232 88.1856 14.9582 2.5999 13.3802 44.1257 2.2859 270.6342 80.2286 1.0165 6.1184 15.3853 12.6511 37.9120 31.5291 16.2564 2.9633 1.1801 25.7467 19.0535 16.6157 5.3148 5.4647 14.3174 12.0449 198.4416 55.5755 82.9573 15.6579 7.5768 1.8750 58.5650 51.1970 5.1441 38.3779 25.5628 7.6563 14.7928 57.2178 11.5900
temp: 298.150 k
press: 1.00000 atm
elementType: 8 8 8 6 6 6 6 6 6 6 1 1 1 1 1 1 1 1 1 1 1 1 1 1
symmnumber: 1
zpe: 530490.6 jmol-1
zpe.correction: 0.202053 hartree
zpe.thermalcorrener: 0.214262 hartree
zpe.thermalcorrenthalpy: 0.215206 hartree
zpe.thermalcorrgfe: 0.162173 hartree
zpe.sumelectzpe: -499.974734 hartree
zpe.sumelectthermal: -499.962526 hartree
zpe.sumelectthermalent: -499.961582 hartree
zpe.sumelectthermalfe: -500.014614 hartree
dipole: 2.1011 -1.9932 0.5803
dipole: 2.9537
quadrupole: -52.1676 -63.7590 -61.6101
quadrupole: 8.2220 5.7696 -1.8162
quadrupole: 7.0113 -4.5801 -2.4312 8.2220 5.7696 -1.8162
hfenergy: -500.1767875 hartree
pointgroup: C01 [X(C7H14O3)]
dipole: 0.8281426 0.7887245 -0.2061332 debye
dipolederiv: -0.7316407 0.2404812 -0.059736 0.2652393 -0.8665901 0.0365175 -0.0725316 0.1103289 -0.4185255 -1.691477 -0.2857076 -0.0202042 -0.3731123 -0.5533124 -0.1018997 -0.0437036 -0.0979376 -0.3218247 -0.6692399 0.0506581 0.0485485 -0.3380658 -0.8540837 -0.2248593 -0.1269611 -0.2547428 -0.4191406 0.4713764 -0.0135669 0.0715039 -0.1605666 0.6873328 -0.0826774 0.1235996 -0.1867555 0.4347152 -0.1504168 0.006509 0.0110652 0.0028079 0.0068729 -0.0121123 0.0416856 -0.0085893 0.1205083 0.8428979 0.0145864 -0.0123802 -0.0608584 0.200984 -0.0202415 -0.0870089 -0.047565 0.3339753 -0.139138 -0.138541 -0.0039148 -0.0435797 -0.1271343 0.0164929 -0.0352705 0.0237871 0.0448205 0.5380903 -0.2200747 0.0355783 -0.1673805 0.4403151 0.0599811 -0.0606911 0.1621234 0.2822504 1.7207123 0.136836 -0.049079 0.6182444 1.1299582 0.3890254 0.1623449 0.4250104 0.3702313 -0.3018521 0.1332349 0.0880438 0.195854 -0.1261741 -0.0899195 0.1181446 -0.0889298 -0.0178504 0.0157804 -0.0049683 -0.0132973 0.0236714 -0.0651421 -0.1042556 -0.0419204 -0.0194626 -0.2216973 0.0693977 -0.0084103 -0.0198031 -0.0369822 0.0679063 -0.0495048 -0.0022033 -0.0778741 -0.104353 0.0569411 0.0448671 -0.0119733 0.0105879 -0.0864772 0.0912733 -0.0308622 0.1093727 0.0182714 -0.0352919 -0.0089929 -0.0102686 0.0408558 0.0505 -0.0465161 0.0373225 -0.0499489 -0.1160943 0.023276 -0.0135881 0.0124762 0.050276 -0.0306382 0.0572028 0.026198 0.0795504 0.0171933 -0.1723665 0.038379 0.0519739 0.0824426 0.0706872 -0.0375734 0.0532069 -0.0378099 0.0765433 0.0858888 -0.0074047 0.0237093 -0.0287315 0.0693107 -0.0429206 -0.0240477 -0.0955793 -0.1148677 0.097348 0.0531108 -0.049343 0.0319734 -0.0838149 0.1063336 -0.0365713 0.1195849 0.0127118 0.0094175 0.0386186 -0.0552131 0.0332345 0.0273856 -0.0458349 0.0371348 -0.1585545 -0.1879646 0.0756251 0.0104849 0.0124523 0.0556286 -0.092687 0.1069277 -0.0086473 0.124361 0.0268651 -0.235684 -0.0182626 -0.0266328 -0.1213001 -0.0037731 -0.0306844 0.0129475 -0.0548612 0.0691242 0.0923067 -0.0047509 0.0277061 0.0187383 -0.0312237 0.086541 -0.0111266 0.1004388 0.0768932 0.0895717 0.0124223 -0.0380184 -0.0012221 0.1250933 -0.0296139 0.0027813 -0.0420184 -0.0739637 -0.0615228 -0.0559202 -0.0131937 -0.0977548 0.0447047 -0.0316817 -0.0338202 -0.0339285 0.1121785 unknown
polarizability: 108.0003886|-0.7720965|85.8845921|-0.9621338|2.8072097|67.8214593 unknown
InChI: InChI=1S/C7H14O3/c1-6(9-3)4-5-10-7(2)8/h6H,4-5H2,1-3H3
charge 0 multiplicity 1
24 atoms
O  2.355177 -0.715125 0.539528
O  -1.669017 0.543795 0.193697
O  -2.784983 -1.349311 -0.585465
C  2.109616 0.451741 -0.33686
C  0.712245 0.967998 0.051693
C  -0.367868 -0.088171 -0.182429
C  3.193947 1.533307 -0.172405
C  3.483659 -1.54608 0.125406
C  -2.817165 -0.212723 -0.061137
C  -4.054183 0.540526 0.381871
H  2.095031 0.099042 -1.396347
H  0.721921 1.257912 1.118569
H  0.480891 1.873317 -0.540256
H  -0.423645 -0.406468 -1.240504
H  -0.205943 -0.980957 0.443426
H  4.192385 1.160454 -0.462237
H  3.239968 1.868985 0.879026
H  2.96609 2.407991 -0.809213
H  3.381867 -1.869479 -0.933128
H  3.462992 -2.432481 0.77931
H  4.457063 -1.029101 0.25019
H  -4.116417 1.511111 -0.139977
H  -4.001615 0.752916 1.463776
H  -4.950017 -0.0582 0.163767
