program: Gaussian 09
title: 000242946
version: EM64L-G09RevD.01
frameworkgroup: C1[X(C8H5NO2S)]
method: RPBEPBE
basis: SDD
operation: Freq
keyword: #p
keyword: freq=noraman
keyword: PBEPBE/SDD
title: #p freq=noraman PBEPBE/SDD
converged: YES YES NO NO
title: Mulliken charges:
elementType: S O O N C C C C C C C C H H H H H
charge: 0.158693 -0.440801 -0.246953 0.314395 0.265540 -0.321827 -0.294566 0.497204 -0.371952 -0.368605 0.114964 -0.778530 0.279478 0.282287 0.261849 0.260430 0.388395
chargesum: 0.00000
title: Mulliken charges with hydrogens summed into heavy atoms:
elementType: S O O N C C C C C C C C
charge: 0.158693 -0.052406 -0.246953 0.314395 0.265540 -0.042349 -0.012280 0.497204 -0.110103 -0.108175 0.114964 -0.778530
polarizability: 2.80251928e+02 2.71866746e+00 9.58736220e+01 5.33045920e-03 -4.30939188e-04 4.25310732e+01
1716.lowfreq: -6.7699 -4.7716 -0.0020 -0.0012 0.0008 9.1868 22.4960 44.8261 74.7538
frequency: 22.4910 44.8216 74.7509 137.0310 185.2173 268.8830 301.6597 369.2650 408.5822 424.4549 428.2171 462.4617 502.6837 510.8990 592.1462 620.4283 631.9094 684.7601 750.6347 761.5474 845.5024 868.2864 906.0253 988.1621 995.1057 999.1881 1022.0166 1113.6178 1150.1553 1187.8628 1277.4237 1299.6326 1325.2918 1362.6861 1423.3313 1494.6313 1559.8206 1614.3101 1641.2862 2191.5032 3156.1133 3161.7550 3175.1541 3184.9429 3534.5241
redmass: 10.9139 10.1929 6.9296 8.4893 7.2422 13.9740 6.1844 8.7585 2.9086 10.6018 8.9523 6.4920 6.5222 3.1318 1.2282 5.1191 7.2410 3.4475 6.3284 4.4818 1.2458 1.7084 8.0048 1.3650 1.3637 4.1911 2.8374 1.3399 1.6421 1.1904 3.8717 1.3191 3.0165 5.4314 3.9717 2.7922 7.7292 6.2711 8.7854 12.8833 1.0888 1.0897 1.0974 1.0973 1.0642
irintensity: 0.2469 0.3038 0.8658 0.0001 1.2485 0.5117 3.8031 3.0537 0.3633 5.8831 2.4079 51.4895 4.6627 37.6165 78.0715 10.4480 0.7830 81.7689 32.0980 18.4748 0.3016 68.9504 54.4996 0.2401 0.0845 139.1298 230.7416 8.1329 160.5587 4.4484 0.1882 10.7530 167.9162 8.3515 15.9677 32.1110 16.0140 226.4904 379.3713 1573.2327 0.5750 2.8900 3.5280 1.2586 63.3158
temp: 298.150 k
press: 1.00000 atm
elementType: 16 8 8 7 6 6 6 6 6 6 6 6 1 1 1 1 1
symmnumber: 1
zpe: 297039.8 jmol-1
zpe.correction: 0.113136 hartree
zpe.thermalcorrener: 0.123736 hartree
zpe.thermalcorrenthalpy: 0.124680 hartree
zpe.thermalcorrgfe: 0.074519 hartree
zpe.sumelectzpe: -910.294191 hartree
zpe.sumelectthermal: -910.283591 hartree
zpe.sumelectthermalent: -910.282647 hartree
zpe.sumelectthermalfe: -910.332809 hartree
dipole: 1.4308 -1.3400 0.0009
dipole: 1.9603
quadrupole: -85.6618 -71.7601 -77.6237
quadrupole: -8.6551 0.0009 0.0032
quadrupole: -7.3133 6.5885 0.7248 -8.6551 0.0009 0.0032
hfenergy: -910.4073275 hartree
pointgroup: C01 [X(C8H5N1O2S1)]
dipole: -0.5577537 -0.532315 0.0189789 debye
dipolederiv: -1.4818193 0.004845 0.0154314 0.0064395 -0.0488974 -0.0001232 0.0153141 -0.000105 -0.0511953 -0.8613966 -0.4558223 0.0160885 -0.7604606 -0.9762332 0.0219641 0.0238916 0.0188082 -0.429224 -1.1927211 0.2862818 0.0024241 0.3498558 -0.8095527 0.0080067 0.001127 0.0084984 -0.3326595 -3.0172385 0.0112351 0.0323026 0.0173517 -0.1367599 0.0027709 0.032078 0.0028228 -0.0184788 -1.1322276 -0.0172957 0.0128797 -0.0080319 -0.0746364 0.0018576 0.0126512 0.001979 -0.0030055 0.319809 -0.0975565 -0.0020978 0.1601882 0.0436397 -0.0052747 -0.0084852 -0.0024354 -0.0956956 0.3463556 0.0954981 -0.0072279 -0.1426735 0.0355772 -0.0017033 -0.001375 -0.0043408 -0.0960443 1.8428135 -0.0038693 -0.0187079 0.0039097 0.2881549 -0.0044472 -0.0188157 -0.0043375 0.1112808 -0.5069013 0.1324819 0.0004148 0.3066689 -0.0064896 -0.0072843 -0.0039545 -0.0054099 -0.1631748 -0.5279942 -0.1239577 0.0070598 -0.3209446 -0.0044796 -0.0005061 0.0119002 -0.0026861 -0.1652327 2.5170152 0.0823581 -0.0273632 0.2342815 1.3881175 -0.0311207 -0.0315201 -0.0294443 0.2382914 3.2283693 -0.0145007 -0.0353476 -0.0201677 -0.0433699 -0.0002093 -0.0350908 -0.000272 -0.0602157 0.0800891 0.0656494 -0.0007891 0.0381952 0.029631 0.0028119 -0.0001227 0.0025133 0.1585669 0.0885768 -0.0495547 0.0020291 -0.0537899 0.0243406 0.0040022 0.0021733 0.00397 0.1611113 0.0408765 -0.0714748 0.0032286 -0.0699148 -0.0018827 0.005099 0.0031788 0.0051346 0.1712388 0.0388601 0.0722436 -0.000365 0.0722373 -0.0039724 0.0035538 -0.0003958 0.0035792 0.1700968 0.2175336 0.0834388 0.00004 0.186855 0.2968127 0.0006025 -0.0025545 0.0017255 0.4043399 unknown
polarizability: 280.2588835|-0.991481|95.8058163|-2.5773705|-1.3132612|42.5919237 unknown
InChI: InChI=1S/C8H5NO2S/c10-8(11)6-1-3-7(4-2-6)9-5-12/h1-4,10H
charge 0 multiplicity 1
17 atoms
S  5.473335 0.001127 -0.102284
O  -3.629043 -1.225774 0.028013
O  -3.750953 1.094195 -0.028001
N  2.638667 0.014643 -0.071951
C  -1.565899 0.005153 -0.025774
C  -0.855583 1.234233 -0.064193
C  -0.8512 -1.22133 -0.003164
C  1.262092 0.012002 -0.056971
C  0.547849 1.245073 -0.079898
C  0.553447 -1.223481 -0.018523
C  -3.050028 0.053138 -0.010376
C  3.84629 0.007902 -0.084853
H  -1.424135 2.169413 -0.081326
H  -1.406485 -2.162374 0.026428
H  1.103858 2.186654 -0.10957
H  1.114567 -2.162412 -0.001196
H  -4.618781 -1.129564 0.036739
