program: Gaussian 09
title: 000242939
version: EM64L-G09RevD.01
frameworkgroup: C1[X(C10H16N4O6)]
method: RPBEPBE
basis: SDD
operation: Freq
keyword: #p
keyword: freq=noraman
keyword: PBEPBE/SDD
title: #p freq=noraman PBEPBE/SDD
converged: YES YES NO NO
title: Mulliken charges:
elementType: O O O O O O N N N N C C C C C C C C C C H H H H H H H H H H H H H H H H
charge: -0.287455 -0.287454 -0.191323 -0.214938 -0.214939 -0.191322 -0.132696 -0.132696 0.139492 0.139489 -0.384083 -0.380111 -0.380109 -0.384081 0.263553 0.263551 -0.525746 -0.525746 -0.371505 -0.371506 0.241755 0.243150 0.274967 0.230476 0.274967 0.230476 0.241755 0.243150 0.276252 0.250872 0.250871 0.276252 0.297416 0.269925 0.269926 0.297417
chargesum: 0.00000
title: Mulliken charges with hydrogens summed into heavy atoms:
elementType: O O O O O O N N N N C C C C C C C C C C
charge: -0.287455 -0.287454 -0.191323 -0.214938 -0.214939 -0.191322 -0.132696 -0.132696 0.139492 0.139489 0.100822 0.125332 0.125334 0.100824 0.263553 0.263551 0.001378 0.001377 0.195836 0.195837
polarizability: 2.37189436e+02 -1.36924359e+01 1.48412124e+02 -2.51948080e+00 1.40105527e+00 1.03865509e+02
1716.lowfreq: -4.9482 -0.0003 0.0004 0.0009 4.3484 8.6107 11.9033 25.6552 25.7359
frequency: 11.9033 25.6551 25.6895 31.1503 35.8593 48.6754 52.9016 70.6579 79.4274 118.8086 123.4962 142.1533 168.5838 211.3653 250.7205 268.5611 292.5239 303.7813 325.9733 380.2633 411.5534 433.7860 454.2940 481.3675 509.1533 524.6100 554.6093 559.7955 585.5373 586.5341 595.0123 615.1659 652.0918 653.3472 753.1471 759.7831 809.8751 812.2317 837.3691 864.2733 871.4275 919.0046 921.6236 979.2073 1017.5833 1029.8904 1032.4208 1033.8020 1045.4242 1081.3469 1092.3153 1113.7253 1157.2158 1162.1159 1162.3703 1203.2809 1210.7278 1216.2595 1218.1605 1220.9825 1239.1173 1265.9417 1268.4446 1273.5047 1283.4053 1289.0537 1330.7927 1335.1621 1341.4925 1346.3253 1360.0856 1362.3347 1420.3694 1422.7693 1428.1627 1428.2330 1449.5536 1449.7198 1457.3308 1459.0582 1463.1975 1464.7648 1471.3981 1473.0770 1579.1382 1581.2905 2978.3423 2980.4935 2989.7658 2993.0899 2998.0071 2998.0951 3041.6332 3041.6839 3056.6792 3056.7063 3092.5187 3092.6792 3108.6091 3108.7835 3129.3715 3129.3745
redmass: 9.6668 8.9095 5.0011 10.8819 8.1371 6.0413 4.7823 5.9264 5.7976 4.2401 2.3631 2.2933 3.7385 6.1347 7.0552 5.1520 2.5646 2.8590 8.1303 3.8715 1.9497 5.4698 2.6890 4.0097 4.0235 3.6384 3.0966 2.8246 5.0357 5.1925 5.8670 3.1408 6.4099 3.1723 4.3885 3.4774 1.7887 1.9640 1.6066 4.4011 3.9717 3.5534 2.8253 2.6496 2.7030 2.2720 1.9697 2.2343 1.7576 3.0965 3.1267 2.3011 3.5017 1.1990 1.1978 1.3066 1.4941 2.2065 2.7482 2.3635 2.1878 1.8055 1.6668 1.3843 1.3751 1.4121 1.5859 1.7147 1.3994 1.2704 1.3460 1.3889 2.7401 2.7490 3.9565 3.8818 1.1204 1.1202 1.0956 1.1017 1.1579 1.1185 1.1189 1.1065 7.1494 7.5918 1.0691 1.0693 1.0665 1.0668 1.0598 1.0598 1.0629 1.0629 1.0999 1.0999 1.0963 1.0966 1.0941 1.0940 1.1019 1.1019
irintensity: 5.6443 1.1178 0.0053 0.0000 4.1104 0.3061 0.0000 20.9248 0.0000 0.0000 5.1980 0.0000 26.0043 0.0000 3.8540 0.0000 14.2619 10.8488 0.0000 17.3203 0.0000 0.0000 0.0000 3.3473 0.0000 23.9737 14.7791 0.0000 67.0133 0.0003 0.0000 22.2478 0.0000 20.4147 0.0000 7.4352 0.0000 20.6361 0.0000 0.0000 9.4392 0.0000 6.3330 44.0190 90.0400 0.0000 16.1074 0.0000 9.2083 0.0000 1.9433 0.0000 9.5402 34.1626 0.0000 0.0000 180.5044 0.0001 397.7574 0.0000 0.0000 21.9106 0.0000 53.7996 0.0000 30.7073 0.0000 91.7851 0.0000 3.6137 0.0000 22.1285 0.0000 375.0200 0.0254 273.7928 21.9096 0.0001 61.4248 0.0000 33.6587 0.0000 21.1488 0.0000 625.7703 0.0001 30.5474 0.0001 0.0001 105.5530 35.2551 0.0538 39.0075 0.0404 13.2788 0.0531 12.4657 0.0013 30.7661 0.0021 0.7279 7.1057
temp: 298.150 k
press: 1.00000 atm
elementType: 8 8 8 8 8 8 7 7 7 7 6 6 6 6 6 6 6 6 6 6 1 1 1 1 1 1 1 1 1 1 1 1 1 1 1 1
symmnumber: 1
zpe: 730620.0 jmol-1
zpe.correction: 0.278278 hartree
zpe.thermalcorrener: 0.298525 hartree
zpe.thermalcorrenthalpy: 0.299470 hartree
zpe.thermalcorrgfe: 0.223595 hartree
zpe.sumelectzpe: -1059.316573 hartree
zpe.sumelectthermal: -1059.296326 hartree
zpe.sumelectthermalent: -1059.295382 hartree
zpe.sumelectthermalfe: -1059.371257 hartree
dipole: -0.0001 0.0000 0.0003
dipole: 0.0003
quadrupole: -199.4629 -131.4577 -111.8360
quadrupole: -4.9256 -10.8472 -1.1711
quadrupole: -51.8774 16.1278 35.7495 -4.9256 -10.8472 -1.1711
hfenergy: -1059.5948514 hartree
pointgroup: C01 [X(C10H16N4O6)]
dipole: -0.0000484 -0.0000088 -0.0001002 debye
polarizability: 237.1139717|14.0705952|148.1667961|1.0297289|4.2020157|104.1863021 unknown
InChI: InChI=1S/C10H16N4O6/c15-9(1-3-13(17)18)11-5-7-12(8-6-11)10(16)2-4-14(19)20/h1-8H2
charge 0 multiplicity 1
36 atoms
O  -2.794357 -2.137939 0.278076
O  2.796985 2.142569 -0.25392
O  -7.377387 -0.024314 -0.112579
O  5.913463 -1.417003 -0.839059
O  -5.910768 1.421591 0.863432
O  7.380012 0.029005 0.136903
N  -1.286478 -0.487985 -0.362582
N  1.289086 0.492612 0.38669
N  -6.194432 0.330099 0.240538
N  6.197076 -0.325468 -0.216215
C  -0.901163 0.894092 -0.719424
C  -0.148553 -1.426751 -0.255563
C  0.151163 1.431381 0.279666
C  0.90377 -0.889464 0.743531
C  -2.572423 -0.939816 -0.091893
C  2.575036 0.944442 0.116026
C  -3.721815 0.068644 -0.251123
C  3.72442 -0.064024 0.275283
C  -5.062576 -0.650014 -0.069321
C  5.065189 0.654637 0.093556
H  -0.470274 0.903961 -1.740695
H  -1.779806 1.555802 -0.710732
H  -0.546355 -2.398572 0.078956
H  0.31709 -1.549648 -1.25387
H  0.548968 2.4032 -0.054857
H  -0.31448 1.554285 1.277971
H  0.472879 -0.899335 1.764802
H  1.782414 -1.551172 0.734838
H  -3.644109 0.867961 0.510384
H  -3.681552 0.561284 -1.239966
H  3.684114 -0.556686 1.264114
H  3.646742 -0.863326 -0.48624
H  -5.013075 -1.35405 0.780149
H  -5.386655 -1.214376 -0.955533
H  5.389207 1.219014 0.979781
H  5.015744 1.358667 -0.755922
