program: Gaussian 09
title: 000020495
version: EM64L-G09RevD.01
frameworkgroup: C1[X(C24H28ClN3OS)]
method: RPBEPBE
basis: SDD
operation: Freq
keyword: #p
keyword: freq=noraman
keyword: PBEPBE/SDD
title: #p freq=noraman PBEPBE/SDD
converged: NO YES NO NO
title: Mulliken charges:
elementType: Cl S O N N N C C C C C C C C C C C C C C C C C C C C C C C C H H H H H H H H H H H H H H H H H H H H H H H H H H H H
charge: -0.065211 0.202864 -0.279180 -0.076224 -0.076836 -0.384338 -0.380949 -0.361718 -0.354722 -0.379508 -0.343540 -0.330885 -0.493338 -0.542357 -0.283598 0.210687 0.257044 0.463022 0.382671 -0.397722 -0.360251 -0.364411 -0.374384 -0.259392 -0.286033 -0.113990 -0.262684 -0.238889 -0.234545 -0.607059 0.184279 0.206898 0.196321 0.189350 0.195975 0.185502 0.186580 0.212306 0.177189 0.219626 0.180520 0.256839 0.265574 0.206896 0.251238 0.206680 0.221471 0.301451 0.275677 0.256123 0.254177 0.250364 0.232733 0.259936 0.233750 0.277755 0.225045 0.225219
chargesum: 0.00000
title: Mulliken charges with hydrogens summed into heavy atoms:
elementType: Cl S O N N N C C C C C C C C C C C C C C C C C C C C C C C C
charge: -0.065211 0.202864 -0.279180 -0.076224 -0.076836 -0.082887 0.010229 0.023954 0.026755 0.019378 0.053276 0.106474 -0.020867 -0.084440 -0.062127 0.210687 0.257044 0.463022 0.382671 -0.397722 -0.360251 -0.088734 -0.118261 -0.005216 -0.035670 -0.113990 -0.029952 0.021047 -0.000795 0.120961
polarizability: 3.93674646e+02 -2.96702666e+01 3.39398603e+02 3.81453884e+01 6.75243653e+00 2.41513708e+02
1716.lowfreq: -9.4970 -4.6763 -0.0014 -0.0007 0.0007 2.1328 5.2995 12.0657 16.6349
frequency: -4.2801 11.8162 16.5761 26.9343 33.3124 40.9832 50.7764 55.1746 84.6804 86.6366 93.6139 105.9719 113.4184 134.0561 141.7017 157.8638 175.0349 193.0118 208.3842 210.4828 238.4140 241.2857 258.9585 262.9954 280.7724 292.5079 309.3739 318.7381 341.5032 361.9827 374.7009 386.3756 400.9466 417.3660 421.6015 445.7238 448.1078 460.2431 477.7988 491.3638 499.3121 515.9417 537.6520 560.8214 594.2769 608.3623 618.0909 629.3180 651.6504 664.2124 691.5907 704.3849 715.8585 743.6517 753.6019 765.7601 768.1393 787.0868 790.7367 803.5344 809.4032 846.2585 855.1180 872.9368 881.1103 883.0462 920.8546 931.7340 943.4563 949.7289 984.1351 1000.7895 1006.9560 1015.8890 1025.6312 1032.9852 1040.4386 1045.0064 1048.8997 1052.9333 1061.7588 1084.5238 1086.6783 1095.6562 1108.2053 1121.1254 1121.4305 1128.8129 1134.7270 1135.9140 1138.2723 1147.4012 1149.8363 1174.2670 1177.4152 1190.7523 1194.9234 1223.3177 1224.7463 1234.9491 1251.9275 1261.4458 1263.4032 1272.9802 1287.6122 1295.1155 1306.2150 1308.5801 1318.4649 1336.9750 1344.8202 1350.0241 1361.0347 1363.9045 1367.7932 1370.3973 1391.4619 1394.5194 1396.1342 1414.9492 1424.5118 1445.2535 1446.7332 1450.6097 1455.9094 1456.8922 1458.6083 1460.7699 1461.3752 1465.6545 1478.8931 1482.4804 1487.2079 1513.6370 1555.4046 1569.0554 1584.0148 1600.1905 1623.3880 1631.9863 2830.9162 2848.6744 2850.5702 2860.2532 2865.7118 2876.4517 2953.7780 2977.7130 2983.9666 3021.6384 3029.9619 3033.8310 3036.2171 3038.6804 3041.6687 3055.9510 3056.6539 3057.3003 3080.2590 3108.0386 3132.5716 3143.1134 3147.7909 3156.0644 3164.9348 3169.9025 3176.6067 3559.5675
redmass: 4.7994 4.3560 5.1844 5.0543 4.0879 4.9972 5.1235 3.9077 4.3373 3.6998 6.7442 1.1314 4.3741 4.1836 2.7236 4.6318 3.3531 3.2172 5.1001 3.1609 3.0673 2.8645 3.9203 3.0842 5.7129 3.7262 6.3318 2.7999 2.8647 5.0597 4.7210 4.1525 2.5684 4.5242 4.1738 3.3315 3.1813 4.1907 4.4293 3.7701 3.7039 5.5378 5.0376 1.3631 3.4535 2.3211 2.7376 4.9253 4.4606 6.4892 3.4282 5.3963 3.8045 2.5260 3.9047 1.5503 3.0576 1.5966 2.4399 1.6710 1.3499 1.5405 1.3627 1.3682 3.1768 1.5067 5.2148 2.2292 1.3473 1.3899 1.3196 2.5263 2.9857 2.5077 5.4277 2.2455 3.0220 2.7692 2.7850 2.7113 2.2217 1.9742 2.4353 2.5703 2.5659 1.3246 1.7517 2.2783 1.8023 1.5932 2.3659 2.8582 2.0995 1.0821 2.1232 1.2934 1.1180 1.7995 1.5765 1.6292 1.2674 1.3600 1.3527 1.3407 1.3578 1.4714 1.3174 1.3636 1.4212 1.2818 1.3924 1.9700 1.5037 5.4039 1.4197 7.0175 1.4865 1.4520 2.7129 1.1763 2.2442 2.6385 1.0957 1.0864 1.2872 1.0936 1.1365 1.1396 2.1128 1.0960 1.0984 1.0985 1.0456 1.4618 6.8937 6.3901 7.3328 6.7706 6.1700 8.1617 1.0708 1.0715 1.0707 1.0702 1.0701 1.0679 1.0670 1.0348 1.0590 1.0868 1.0894 1.0902 1.0912 1.0892 1.0881 1.0926 1.0959 1.1022 1.0883 1.0982 1.0852 1.0897 1.0894 1.0947 1.0921 1.1007 1.0967 1.0777
irintensity: 1.1762 2.0110 0.4532 0.8098 6.5337 0.5423 0.5927 0.2629 0.0849 0.5248 1.2377 0.4312 1.0026 1.3768 4.2177 1.0946 0.6614 2.6915 1.4902 3.8912 2.1328 3.2022 0.6810 1.6746 1.3330 0.6767 1.0257 17.3547 14.3282 3.8258 2.4921 4.3577 2.1791 4.5501 1.3084 0.1726 3.9712 10.1434 5.3486 10.8464 2.8766 19.4975 10.5797 85.5683 7.8483 18.9605 0.2218 2.8118 5.4333 4.0251 1.6611 6.5446 4.0721 17.0401 26.2863 58.4592 2.8361 3.6745 12.7359 12.2092 44.5009 0.0326 16.9742 3.6700 1.9134 18.6926 27.8735 23.6441 0.0237 5.7919 0.1052 38.3803 14.5497 38.9270 48.7274 9.0153 10.0838 12.7533 6.0188 4.8223 2.9249 38.6404 6.6458 1.4570 4.8153 4.0984 9.5925 136.4507 8.7575 2.4145 2.9439 69.2659 23.5296 1.6215 7.7171 18.9920 1.2099 52.8950 0.1180 3.8026 22.6890 11.9793 3.6830 8.1901 3.0344 14.6029 39.9566 8.4450 3.8931 0.8534 63.5018 5.3728 1.5509 6.5309 24.9890 0.6173 2.1817 7.9452 27.3047 32.6828 41.0759 83.1630 10.0751 0.6867 97.2496 4.1664 1.0965 12.8648 17.7441 0.4831 17.9909 5.9546 16.0315 137.4608 7.1883 13.7881 4.5875 14.9225 153.9887 4.0388 62.5916 61.0310 62.0838 7.5508 9.2518 316.7175 14.9669 83.1344 14.5182 8.2761 34.0071 47.5567 52.5418 57.7284 0.2875 12.3489 29.8156 45.6423 20.8152 1.9674 0.2784 4.9098 3.3403 21.1650 0.5768 24.0027 3.3153 15.3645
temp: 298.150 k
press: 1.00000 atm
elementType: 17 16 8 7 7 7 6 6 6 6 6 6 6 6 6 6 6 6 6 6 6 6 6 6 6 6 6 6 6 6 1 1 1 1 1 1 1 1 1 1 1 1 1 1 1 1 1 1 1 1 1 1 1 1 1 1 1 1
symmnumber: 1
zpe: 1235899.8 jmol-1
zpe.correction: 0.470729 hartree
zpe.thermalcorrener: 0.498991 hartree
zpe.thermalcorrenthalpy: 0.499935 hartree
zpe.thermalcorrgfe: 0.408305 hartree
zpe.sumelectzpe: -2026.727268 hartree
zpe.sumelectthermal: -2026.699007 hartree
zpe.sumelectthermalent: -2026.698063 hartree
zpe.sumelectthermalfe: -2026.789693 hartree
dipole: -1.8859 2.1157 3.2906
dipole: 4.3430
quadrupole: -188.8635 -191.4445 -187.3338
quadrupole: 2.4349 -28.6214 -4.9033
quadrupole: 0.3505 -2.2306 1.8801 2.4349 -28.6214 -4.9033
hfenergy: -2027.1979974 hartree
pointgroup: C01 [X(C24H28Cl1N3O1S1)]
dipole: -0.7437403 -0.5182591 -1.448357 debye
polarizability: 393.9191483|37.2674004|331.2718784|-30.4298652|27.5738718|249.3959307 unknown
InChI: InChI=1S/C24H28ClN3OS/c1-26-24(29)10-12-28-15-13-27(14-16-28)11-4-6-19-20-5-2-3-7-22(20)30-23-9-8-18(25)17-21(19)23/h2-3,5-9,17,26H,4,10-16H2,1H3
charge 0 multiplicity 1
58 atoms
Cl 6.310714 3.968182 1.654917
S  5.019973 -1.147221 -2.053682
O  -8.872429 0.406833 1.221722
N  -1.797281 0.470343 0.01423
N  -4.684993 0.626267 0.350362
N  -9.425925 0.601045 -1.031535
C  -2.672011 1.033528 -1.045177
C  -2.409684 0.694563 1.347529
C  -4.072508 0.402226 -0.982591
C  -3.809416 0.062243 1.409245
C  -0.405502 0.964381 -0.084726
C  -6.07142 0.112889 0.454475
C  0.603547 0.063249 0.673524
C  -7.0733 0.947809 -0.370245
C  2.011036 0.594047 0.534591
C  3.167553 -0.094011 0.26019
C  -8.520933 0.621708 0.020786
C  4.441827 0.661119 0.054345
C  3.245071 -1.577766 0.121866
C  5.363661 0.282139 -0.960554
C  4.050751 -2.179399 -0.885217
C  4.76351 1.787749 0.860305
C  2.550013 -2.446009 1.009591
C  6.543962 1.023827 -1.19304
C  4.113789 -3.581925 -1.04204
C  5.934723 2.51959 0.608696
C  2.605022 -3.846922 0.862412
C  6.836351 2.163033 -0.413324
C  3.37752 -4.418232 -0.175732
C  -10.85999 0.359696 -0.83276
H  -2.777107 2.143912 -0.945121
H  -2.216856 0.818087 -2.029973
H  -1.775137 0.233038 2.125547
H  -2.495701 1.7881 1.573829
H  -4.706796 0.866807 -1.759269
H  -3.986552 -0.691134 -1.211742
H  -3.703352 -1.047705 1.307654
H  -4.266279 0.275205 2.393369
H  -0.309509 2.020193 0.283604
H  -0.124014 0.972646 -1.154881
H  -6.142882 -0.964235 0.153954
H  -6.389849 0.174222 1.510402
H  0.514397 -0.967702 0.289418
H  0.321233 0.027379 1.74753
H  -6.88364 2.014811 -0.141347
H  -6.923491 0.810907 -1.458175
H  2.091752 1.691046 0.592964
H  -9.079729 0.771517 -1.976515
H  4.101511 2.071738 1.683156
H  1.978956 -2.008236 1.834038
H  7.241706 0.711081 -1.976477
H  4.746112 -4.014978 -1.824291
H  2.055504 -4.489877 1.557997
H  7.747696 2.74194 -0.585518
H  3.427535 -5.505541 -0.297059
H  -11.017357 0.202914 0.246501
H  -11.464288 1.225454 -1.161709
H  -11.195993 -0.541467 -1.378543
