program: Gaussian 09
title: 000241111
version: EM64L-G09RevD.01
frameworkgroup: C1[X(C19H20N6O3)]
method: RPBEPBE
basis: SDD
operation: Freq
keyword: #p
keyword: freq=noraman
keyword: PBEPBE/SDD
title: #p freq=noraman PBEPBE/SDD
converged: YES YES NO NO
title: Mulliken charges:
elementType: O O O N N N N N N C C C C C C C C C C C C C C C C C C C H H H H H H H H H H H H H H H H H H H H
charge: -0.249574 -0.249574 -0.199234 -0.437525 -0.437525 0.058941 0.058941 -0.421683 -0.421683 0.489666 0.489666 0.481497 0.481498 -0.340477 -0.340476 -0.452385 -0.452385 -0.377233 -0.377234 -0.381537 -0.381537 -0.397086 -0.397086 0.213007 0.213007 -0.800050 -0.800050 0.350823 0.310818 0.310818 0.217184 0.217184 0.282890 0.282890 0.221725 0.221725 0.308081 0.308081 0.199259 0.199258 0.236756 0.271081 0.236728 0.236776 0.236708 0.271081 0.254123 0.254123
chargesum: 0.00000
title: Mulliken charges with hydrogens summed into heavy atoms:
elementType: O O O N N N N N N C C C C C C C C C C C C C C C C C C C
charge: -0.249574 -0.249574 -0.199234 -0.129444 -0.129444 0.058941 0.058941 -0.167560 -0.167560 0.489666 0.489666 0.481497 0.481498 -0.029659 -0.029659 -0.235201 -0.235201 -0.094342 -0.094344 -0.159812 -0.159812 -0.197827 -0.197828 0.213007 0.213007 -0.055485 -0.055485 0.350823
polarizability: 7.59005910e+02 7.18843807e-05 2.79158917e+02 3.99501135e-02 -2.65722363e-02 1.10806607e+02
1716.lowfreq: -69.2308 -69.2174 -8.3508 -3.8402 -0.0018 -0.0012 0.0013 2.0213 7.0573
frequency: -69.2307 -69.2174 -8.3301 13.3632 16.0162 37.5428 46.5539 50.1385 61.4328 65.0094 78.4226 83.3742 95.9271 129.0573 144.7551 147.3588 148.0339 164.6567 202.1006 224.5122 239.7771 246.8482 253.0097 257.4296 323.5151 335.2530 344.4477 372.5453 391.5937 394.4695 416.6743 416.6937 422.5603 450.8260 499.1574 502.4536 533.9837 537.3926 551.2977 581.6720 581.7615 594.8435 603.4303 631.3284 636.4277 646.1121 646.1550 646.9184 666.7434 689.3450 740.3573 740.6138 744.4599 811.5281 818.1412 820.4034 820.5474 845.4103 878.8633 883.4015 883.6955 923.4889 924.6432 928.7971 928.9914 950.4527 950.8956 984.1962 984.3933 1003.3284 1004.9293 1008.3090 1016.1066 1016.1425 1024.2022 1030.5696 1030.5756 1124.3719 1127.2068 1135.2724 1151.4373 1188.5136 1188.8100 1216.2448 1216.3717 1239.9083 1242.0161 1269.2199 1269.6790 1307.2933 1307.7617 1340.7034 1340.7120 1372.9075 1373.2178 1376.3259 1376.3970 1423.4942 1423.5833 1448.1414 1448.1529 1468.8577 1468.8614 1490.2505 1491.6821 1496.5551 1506.0277 1518.2342 1523.2196 1569.9122 1573.1179 1593.4311 1596.3930 1622.6945 1623.2395 1637.2821 1637.3780 1694.6959 2950.3030 2950.6361 2986.7367 2986.7402 3071.5249 3071.5268 3106.5080 3106.5449 3132.6045 3132.6511 3137.1477 3137.1523 3159.1376 3159.1414 3197.4217 3197.4294 3338.8273 3349.7590 3517.5724 3517.5867
redmass: 1.0499 1.0496 4.8659 6.5610 5.5695 4.3108 6.8284 6.0336 4.9601 4.9183 4.7251 3.9284 7.9270 4.8709 5.0264 5.7110 3.1500 4.2481 6.3804 3.2735 8.3483 4.2818 4.8389 5.3309 4.2830 6.1081 5.9073 4.7628 3.5603 4.0990 3.0886 3.1721 5.3069 5.6739 4.9078 1.4933 2.4328 2.5069 4.6331 2.9120 2.9216 5.4646 1.3014 7.0609 6.7547 1.1803 1.1803 5.8453 6.2338 7.6128 3.5906 3.6033 6.4737 4.2864 4.5037 1.4249 1.4246 5.2656 4.3994 1.3710 1.3729 1.4737 1.4666 6.6208 6.6121 1.4633 1.4668 1.6945 1.6931 3.8426 2.6679 3.3758 1.3235 1.3235 7.6648 1.6603 1.6603 1.4792 1.3603 2.8870 4.3168 1.1365 1.1287 3.2111 3.2163 1.7130 1.6691 2.1414 2.1259 1.4342 1.4332 2.1834 2.0306 2.6277 2.5802 1.2926 1.2997 3.9531 3.9586 1.1684 1.1655 1.0470 1.0470 1.8060 1.8704 1.8688 2.0690 2.8156 2.1430 5.4482 5.2494 5.4747 5.5493 5.8282 5.8845 5.3544 5.3566 8.6389 1.0862 1.0863 1.0385 1.0385 1.0983 1.0983 1.0869 1.0869 1.0965 1.0965 1.0978 1.0978 1.0913 1.0913 1.0951 1.0951 1.0749 1.0740 1.0764 1.0764
irintensity: 0.0570 0.0285 0.0000 0.4355 13.5639 0.0000 1.3163 0.6508 1.7402 0.0000 21.3895 0.0001 0.2937 0.9673 3.2589 34.1122 0.0016 0.0003 1.8322 22.1622 0.0014 0.0000 26.5474 9.2652 0.6820 0.1087 0.5204 0.2909 0.0000 2.8982 0.0000 0.3276 0.3229 10.2364 2.2577 0.0001 51.5763 0.0004 3.1988 0.8017 0.0000 0.8818 203.2191 0.6746 2.0408 1.4483 123.3571 28.9329 5.8102 1.6688 0.0000 1.3582 12.1028 1.7166 0.1527 0.0003 82.2539 1.2557 12.5050 0.0004 58.8939 0.0003 91.0760 10.1515 3.8813 0.0001 23.1360 104.5611 17.6252 0.5176 29.8486 0.1596 0.0001 0.9979 39.3341 0.0187 16.1936 20.1523 26.1379 2662.4935 2.0660 19.7166 0.9493 111.9804 41.3235 27.8589 6.8952 159.0846 2.3896 46.4667 15.4765 115.3790 136.3210 107.8891 161.2528 205.1208 15.0465 47.7606 83.7266 29.6829 79.2186 0.1387 39.9727 53.1203 0.0125 1787.0642 109.4890 0.5116 37.7373 36.9096 28.4638 53.8342 22.6819 165.7960 65.3879 18.3597 203.5979 178.3317 43.4939 116.5036 17.4045 3.7178 0.6054 30.6184 56.2138 1.4437 14.3497 38.8782 4.1352 11.0610 0.1451 0.8014 3.7356 4.3364 60.8231 6.9130 14.2216 14.7841
temp: 298.150 k
press: 1.00000 atm
elementType: 8 8 8 7 7 7 7 7 7 6 6 6 6 6 6 6 6 6 6 6 6 6 6 6 6 6 6 6 1 1 1 1 1 1 1 1 1 1 1 1 1 1 1 1 1 1 1 1
symmnumber: 1
zpe: 965666.8 jmol-1
zpe.correction: 0.367803 hartree
zpe.thermalcorrener: 0.392888 hartree
zpe.thermalcorrenthalpy: 0.393833 hartree
zpe.thermalcorrgfe: 0.309261 hartree
zpe.sumelectzpe: -1288.181047 hartree
zpe.sumelectthermal: -1288.155962 hartree
zpe.sumelectthermalent: -1288.155017 hartree
zpe.sumelectthermalfe: -1288.239589 hartree
dipole: 0.0000 -12.4274 0.0045
dipole: 12.4274
quadrupole: -42.1097 -159.5246 -170.2444
quadrupole: -0.0001 0.1365 -0.0042
quadrupole: 81.8499 -35.5651 -46.2848 -0.0001 0.1365 -0.0042
hfenergy: -1288.54885 hartree
pointgroup: C01 [X(C19H20N6O3)]
dipole: -0.0001204 -4.8892799 -0.013784 debye
polarizability: 759.0059119|-0.0121445|279.1573829|0.0149085|0.5089552|110.8081398 unknown
InChI: InChI=1S/C19H20N6O3/c1-13(26)22-17-7-3-15(4-8-17)11-20-24-19(28)25-21-12-16-5-9-18(10-6-16)23-14(2)27/h3-12,22-25H,1-2H3
charge 0 multiplicity 1
48 atoms
O  -8.635172 2.756305 0.015298
O  8.635391 2.75589 0.006713
O  0.000049 0.699803 0.003089
N  -8.844384 0.414861 0.003622
N  8.844477 0.414408 0.003939
N  -2.406244 -0.769598 -0.001256
N  2.406272 -0.769716 -0.000189
N  -1.162403 -1.36233 -0.003791
N  1.162402 -1.362392 -0.001222
C  -7.489085 -0.014489 0.001744
C  7.489156 -0.014873 0.002867
C  -4.81966 -1.019834 -0.00284
C  4.819676 -1.020081 0.000645
C  -6.38522 0.887271 0.006213
C  6.38534 0.886957 0.003425
C  -7.245517 -1.415353 -0.004982
C  7.245512 -1.415739 0.001183
C  -5.07541 0.381765 0.003896
C  5.075502 0.381519 0.002318
C  -5.929829 -1.908456 -0.007235
C  5.929797 -1.908775 0.000093
C  -3.459397 -1.562655 -0.005262
C  3.459386 -1.562836 -0.00042
C  -9.35734 1.719084 0.009966
C  9.357503 1.718617 0.005694
C  -10.886114 1.773386 0.010007
C  10.88628 1.772837 0.006427
C  0.000019 -0.545222 -0.000296
H  -6.57605 1.961494 0.01138
H  6.576229 1.961182 0.004734
H  -8.089452 -2.117673 -0.00844
H  8.089409 -2.118114 0.000746
H  -4.221432 1.066702 0.00728
H  4.221561 1.06651 0.002773
H  -5.760384 -2.992487 -0.012434
H  5.760293 -2.992808 -0.001183
H  -9.538927 -0.336688 -0.000218
H  9.53898 -0.337189 0.003365
H  -3.366764 -2.669944 -0.010594
H  3.366697 -2.670133 -0.001421
H  -11.306995 1.275285 0.903277
H  -11.197375 2.827578 0.014862
H  -11.306764 1.283601 -0.887961
H  11.307326 1.280745 -0.890093
H  11.306713 1.276989 0.90116
H  11.197596 2.827021 0.008715
H  -1.075463 -2.391478 -0.008733
H  1.075413 -2.391547 -0.001858
