program: Gaussian 09
title: 000241113
version: EM64L-G09RevD.01
frameworkgroup: C1[X(C19H22N4O5)]
method: RPBEPBE
basis: SDD
operation: Freq
keyword: #p
keyword: freq=noraman
keyword: PBEPBE/SDD
title: #p freq=noraman PBEPBE/SDD
converged: YES YES NO NO
title: Mulliken charges:
elementType: O O O O O N N N N C C C C C C C C C C C C C C C C C C C H H H H H H H H H H H H H H H H H H H H H H
charge: -0.243736 -0.243736 -0.230149 -0.230148 -0.214038 0.044585 0.044585 -0.422912 -0.422912 0.504384 0.504385 0.228303 0.228302 0.204220 0.204220 -0.507468 -0.507469 -0.439880 -0.439880 -0.333950 -0.333950 -0.404367 -0.404367 -0.537618 -0.537618 -0.538192 -0.538192 0.347317 0.299911 0.299911 0.220330 0.220330 0.241485 0.241486 0.202647 0.202647 0.243039 0.228847 0.228819 0.243039 0.228832 0.228833 0.220753 0.220760 0.248792 0.248792 0.220753 0.220760 0.254757 0.254757
chargesum: 0.00000
title: Mulliken charges with hydrogens summed into heavy atoms:
elementType: O O O O O N N N N C C C C C C C C C C C C C C C C C C C
charge: -0.243736 -0.243736 -0.230149 -0.230148 -0.214038 0.044585 0.044585 -0.168155 -0.168156 0.504384 0.504385 0.228303 0.228302 0.204220 0.204220 -0.207558 -0.207558 -0.219551 -0.219550 -0.092464 -0.092465 -0.201720 -0.201720 0.163087 0.163087 0.152114 0.152114 0.347317
polarizability: 6.87503954e+02 1.56239167e-05 2.80219148e+02 -6.37951746e-02 1.87171420e-02 1.19236888e+02
1716.lowfreq: -11.0586 -8.1795 -4.4036 -0.0020 0.0007 0.0009 1.0034 14.0778 14.5748
frequency: -11.0539 14.0767 14.5748 34.6246 46.6533 49.9261 79.3128 85.9175 96.8029 101.7796 105.1951 129.1487 138.6848 152.3429 159.4447 169.0855 174.6479 182.7634 185.6122 189.1773 213.4216 223.1063 242.6391 253.6430 255.1313 275.7649 281.0747 287.7071 293.2064 303.8175 361.0316 367.0270 402.5878 405.4650 406.9414 435.1873 462.2806 466.9098 467.5135 494.0660 496.6251 534.4108 558.8411 572.1538 594.8093 606.1489 627.8454 629.0453 642.5794 688.8656 705.5139 723.6855 736.8677 748.3530 748.4986 755.7496 797.9986 798.1428 801.0445 896.9617 897.4295 908.6929 908.9394 934.3787 939.2204 940.3887 947.7985 981.1417 981.2760 994.4360 1005.7173 1019.0315 1023.9680 1110.4874 1110.4981 1111.8510 1111.8526 1132.6816 1133.1364 1136.5396 1139.9665 1147.2673 1152.2793 1158.5769 1158.5953 1187.1628 1191.4421 1223.0920 1223.7957 1263.9534 1265.9066 1272.7736 1273.0431 1340.6202 1341.6597 1397.0688 1397.5966 1423.3743 1423.4974 1435.5063 1435.6260 1448.3384 1448.3734 1465.2377 1465.2603 1467.4320 1467.4346 1469.2749 1470.1142 1471.3737 1471.4069 1496.2834 1499.6948 1513.3099 1518.5653 1567.0789 1569.5194 1594.9572 1598.1912 1607.9688 1608.3149 1688.2628 2957.1291 2957.4306 2958.9752 2959.1152 2965.2230 2965.3228 3047.1133 3047.1226 3055.0164 3055.0573 3126.2618 3126.2754 3128.7363 3128.7444 3129.5602 3129.6035 3165.2698 3165.3112 3172.1453 3172.1714 3343.5883 3354.3320
redmass: 4.1128 5.7017 5.9538 4.4816 5.6871 6.4698 3.8735 3.1109 3.6219 6.5406 3.7493 4.1200 3.4991 4.6667 2.9658 2.7269 3.9047 2.7133 4.0259 4.8543 1.6235 1.3245 2.0192 1.2845 1.3289 5.5830 4.1259 2.5281 3.1900 6.1967 3.9524 3.9500 5.9420 4.2892 4.9765 6.4223 7.0527 3.0203 3.1619 7.6055 1.5316 6.8436 4.8485 4.2433 1.2980 5.1580 3.8525 3.6727 6.2590 7.5903 6.5216 5.4776 5.3725 3.1293 3.1354 5.5885 1.4817 1.4822 5.7341 1.4471 1.4500 1.3768 1.3741 6.2241 1.5851 1.5825 5.8126 8.4978 8.5336 5.8238 3.3264 3.5334 8.9666 1.2633 1.2632 1.2606 1.2606 1.8275 1.7738 2.9805 2.4700 1.6784 1.9592 1.3916 1.4027 1.8738 2.0411 1.9887 1.9736 3.1371 3.0759 1.3053 1.3093 1.7774 1.9123 3.3916 3.3318 2.2969 2.3141 1.1933 1.1920 1.7683 1.7883 1.0490 1.0491 1.0501 1.0501 1.1125 1.0987 1.0641 1.0642 1.8910 2.0756 2.4885 1.9515 7.6653 7.6609 6.3184 6.2137 6.2897 6.3312 8.5116 1.0825 1.0816 1.0367 1.0376 1.0326 1.0326 1.1039 1.1039 1.1040 1.1040 1.0898 1.0898 1.0986 1.0986 1.1000 1.1000 1.0934 1.0934 1.0912 1.0912 1.0750 1.0741
irintensity: 0.0000 0.6019 0.0197 0.0000 5.1156 7.2949 33.6155 0.0000 9.2821 0.6883 0.0001 0.0252 0.0000 0.0197 0.0001 0.3233 0.3234 0.0000 7.6199 18.1610 2.0826 0.0000 28.1222 0.0116 0.0000 10.2641 0.5505 0.0002 13.7208 7.9298 3.7719 16.4712 2.4429 0.0003 0.9817 4.1956 0.9597 0.0000 2.9751 0.1249 0.0003 5.3039 1.1943 5.6055 151.5581 54.5925 0.0000 62.5178 5.2734 1.7842 25.2745 23.6772 7.7226 0.0000 0.3581 0.4117 0.0075 76.6773 9.7727 0.0002 8.3789 0.0015 38.7359 1.0189 0.0002 81.5906 26.0429 6.7695 168.0308 51.2973 19.1976 10.5217 81.5740 0.0004 0.1498 0.1689 0.3004 635.3395 68.8667 17.1837 995.3871 779.9455 1.6631 44.2161 25.6074 203.0702 89.7040 67.5400 0.4357 508.9967 132.9925 2.4397 1.1987 84.2633 5.3592 39.3919 5.0190 26.2259 4.4743 35.1035 22.6078 33.7815 5.7195 0.0266 24.1369 0.6244 30.4939 236.0330 86.2128 56.6272 23.8048 920.7292 44.7489 96.1437 33.9527 43.2273 0.1806 16.8827 1.4404 191.6443 19.7908 167.1207 87.1897 69.1575 150.4973 72.3487 16.8072 53.1148 13.5000 80.2141 0.0004 86.8679 22.1295 32.1890 12.7195 4.6516 19.4720 39.0838 30.6734 14.4703 8.6011 2.1049 69.0707 7.2170
temp: 298.150 k
press: 1.00000 atm
elementType: 8 8 8 8 8 7 7 7 7 6 6 6 6 6 6 6 6 6 6 6 6 6 6 6 6 6 6 6 1 1 1 1 1 1 1 1 1 1 1 1 1 1 1 1 1 1 1 1 1 1
symmnumber: 1
zpe: 1016051.8 jmol-1
zpe.correction: 0.386994 hartree
zpe.thermalcorrener: 0.414701 hartree
zpe.thermalcorrenthalpy: 0.415645 hartree
zpe.thermalcorrgfe: 0.326898 hartree
zpe.sumelectzpe: -1330.161044 hartree
zpe.sumelectthermal: -1330.133337 hartree
zpe.sumelectthermalent: -1330.132392 hartree
zpe.sumelectthermalfe: -1330.221139 hartree
dipole: 0.0000 6.9839 0.0084
dipole: 6.9839
quadrupole: -116.6287 -133.8764 -170.4243
quadrupole: 0.0001 -0.0412 0.0012
quadrupole: 23.6811 6.4334 -30.1145 0.0001 -0.0412 0.0012
hfenergy: -1330.5480374 hartree
pointgroup: C01 [X(C19H22N4O5)]
dipole: -0.0000795 -2.7476214 -0.0155572 debye
polarizability: 687.5039332|-0.0133777|280.211826|0.1255915|1.0858249|119.2442307 unknown
InChI: InChI=1S/C19H22N4O5/c1-25-15-7-5-13(9-17(15)27-3)11-20-22-19(24)23-21-12-14-6-8-16(26-2)18(10-14)28-4/h5-12,22-23H,1-4H3
charge 0 multiplicity 1
50 atoms
O  -6.629374 2.288022 0.018478
O  6.629615 2.28764 0.01457
O  -8.712024 0.657173 0.004557
O  8.712159 0.656619 0.006064
O  0.000064 0.675397 0.004433
N  -2.405479 -0.788096 -0.005243
N  2.405519 -0.788249 -0.003941
N  -1.162209 -1.385769 -0.008991
N  1.162213 -1.385849 -0.007258
C  -4.817488 -1.018073 -0.007811
C  4.817515 -1.018389 -0.004496
C  -6.326804 0.924839 0.007369
C  6.326956 0.924454 0.006759
C  -7.46076 0.038568 -0.000127
C  7.460856 0.038089 0.002172
C  -5.028079 0.392787 0.003468
C  5.028197 0.392481 0.003403
C  -5.937028 -1.882909 -0.015097
C  5.936999 -1.883316 -0.008957
C  -7.24845 -1.357286 -0.0113
C  7.248455 -1.357774 -0.005653
C  -3.463558 -1.574856 -0.011675
C  3.46355 -1.57509 -0.007846
C  -5.494677 3.218686 0.027078
C  5.494979 3.218403 0.019972
C  -9.891103 -0.212557 -0.002391
C  9.891183 -0.213202 0.001834
C  0.000026 -0.571983 -0.002949
H  -4.144145 1.036214 0.008937
H  4.144304 1.035977 0.00674
H  -5.790187 -2.969556 -0.023703
H  5.790089 -2.969971 -0.014968
H  -8.100843 -2.042573 -0.017042
H  8.100803 -2.04313 -0.009169
H  -3.381681 -2.682425 -0.019964
H  3.381605 -2.682669 -0.013609
H  -5.94981 4.21955 0.035733
H  -4.868112 3.096065 -0.87716
H  -4.868819 3.080087 0.929495
H  5.950177 4.219255 0.026238
H  4.86853 3.082267 0.922353
H  4.868988 3.0934 -0.884338
H  -9.921071 -0.843004 -0.912573
H  -9.921249 -0.857161 0.897818
H  -10.749156 0.474928 0.00289
H  10.749279 0.474239 0.005891
H  9.921575 -0.845855 -0.906803
H  9.920828 -0.855625 0.903618
H  -1.078014 -2.414841 -0.016373
H  1.077957 -2.414929 -0.012435
