program: Gaussian 09
title: 000242937
version: EM64L-G09RevD.01
frameworkgroup: C1[X(C16H16Br2N2O4S2)]
method: RPBEPBE
basis: SDD
operation: Freq
keyword: #p
keyword: freq=noraman
keyword: PBEPBE/SDD
title: #p freq=noraman PBEPBE/SDD
converged: YES YES NO NO
title: Mulliken charges:
elementType: Br Br S S O O O O N N C C C C C C C C C C C C C C C C H H H H H H H H H H H H H H H H
charge: 0.047993 0.047981 0.899526 0.899568 -0.525106 -0.536971 -0.525129 -0.536969 -0.238430 -0.238481 -0.440308 -0.420601 -0.440310 -0.420628 0.004113 0.004066 -0.267447 -0.267436 -0.219546 -0.219518 -0.158570 -0.158571 -0.158084 -0.158086 -0.211799 -0.211797 0.287616 0.278844 0.299583 0.243960 0.287622 0.278874 0.299668 0.243951 0.302504 0.302500 0.283096 0.283092 0.264858 0.264855 0.264762 0.264759
chargesum: 0.00000
title: Mulliken charges with hydrogens summed into heavy atoms:
elementType: Br Br S S O O O O N N C C C C C C C C C C C C C C C C
charge: 0.047993 0.047981 0.899526 0.899568 -0.525106 -0.536971 -0.525129 -0.536969 -0.238430 -0.238481 0.126152 0.122941 0.126186 0.122991 0.004113 0.004066 0.035056 0.035064 0.063550 0.063573 0.106288 0.106284 0.106678 0.106673 -0.211799 -0.211797
polarizability: 4.36575781e+02 2.58505399e-02 2.67261844e+02 2.86780304e+01 -1.83396951e-02 1.99593163e+02
1716.lowfreq: -3.7463 -2.0611 -0.0019 -0.0007 0.0010 7.7795 8.7943 15.4663 23.5605
frequency: 7.6677 15.3641 23.5441 29.2123 30.8944 44.2593 64.9686 74.6736 80.4378 99.4545 105.9688 128.4406 140.0305 179.5004 181.3352 196.5031 206.4715 226.5814 231.7495 244.2000 250.3145 270.2705 277.3272 300.9106 318.6021 332.8136 336.6406 358.5712 378.7495 382.0203 394.9435 406.5172 406.8205 412.4794 431.3967 453.4947 469.0298 501.5651 502.9631 511.9350 554.2416 610.8758 610.8837 646.8291 687.9365 688.3705 702.8501 703.0572 772.7936 787.6069 788.5805 793.7527 820.7605 823.5148 823.6065 843.3941 843.5468 879.1668 920.3085 920.3646 958.3057 958.3282 978.0197 978.3244 981.3146 981.8276 986.9543 999.5056 1008.8157 1047.3009 1047.7643 1054.7221 1054.7608 1086.7131 1105.2478 1105.2945 1113.5514 1118.9870 1177.8554 1178.4072 1196.2500 1251.2707 1258.9297 1283.0121 1283.0256 1304.1428 1320.6768 1329.7895 1335.5482 1365.7934 1373.9268 1373.9441 1377.3074 1377.3165 1427.8571 1428.9947 1438.5248 1439.7627 1447.2118 1447.4682 1562.8927 1562.9154 1590.4977 1590.5141 2989.6174 2993.1028 2993.2394 2998.7783 3060.1528 3066.6273 3068.4362 3073.3423 3154.8962 3154.9275 3163.9875 3163.9956 3178.3010 3178.3149 3182.8833 3182.8892
redmass: 17.5822 11.3200 7.1468 4.2591 5.3365 4.2543 7.7831 6.6371 9.5439 12.0045 8.6193 7.3802 8.8156 17.0615 15.4446 8.0971 5.9700 8.3466 7.3189 6.1184 4.4751 5.3185 5.9945 4.7568 3.5595 6.3352 6.5125 3.6019 4.4588 3.9398 4.8012 2.9437 2.9128 7.4620 2.8179 8.4399 4.3577 3.4215 4.1106 4.5390 8.5216 7.1042 7.1043 2.0901 6.9473 7.0386 4.0453 4.0826 5.2839 4.4604 14.2435 2.3226 3.3390 1.3425 1.3587 1.3366 1.3346 3.2604 17.2315 16.0392 1.3545 1.3546 4.0001 3.8437 1.6446 1.5948 1.9407 2.7169 2.3639 6.9275 6.9554 1.8227 1.8234 2.1881 1.3533 1.3451 3.8155 5.7196 1.1277 1.1266 1.1733 1.1698 1.2190 1.2300 1.2299 1.1474 1.1753 1.3205 1.2537 1.2606 2.8288 2.8333 11.1135 11.0374 1.0735 1.0782 1.0784 1.0811 2.0984 2.0831 6.1133 6.1140 8.1792 8.1766 1.0637 1.0587 1.0654 1.0610 1.0999 1.1047 1.0976 1.1027 1.0899 1.0899 1.0892 1.0892 1.0961 1.0961 1.0978 1.0978
irintensity: 0.2533 0.3022 0.5276 0.1109 0.0480 0.8061 3.3413 2.3904 0.0871 4.9966 2.1042 2.8041 0.0387 2.9809 1.1338 14.8484 0.0000 5.1913 0.0430 84.5613 0.0000 0.3682 5.3037 9.2287 5.6965 45.8615 14.0099 30.6459 4.5987 0.0131 0.0235 0.2542 0.0304 13.8091 0.0646 6.3165 60.5986 13.5276 17.3861 247.2611 3.2380 0.6739 0.7291 244.2268 122.2593 15.4424 10.5631 2.0851 4.7875 104.9466 21.9727 51.6417 67.1298 7.1528 25.0869 55.2904 12.7048 0.0852 37.7932 118.9883 0.0685 0.0009 84.9776 16.0080 3.3002 16.4430 2.7327 0.7182 15.2943 127.3894 33.5984 2.1118 4.6659 0.2520 8.6083 4.1006 0.2983 9.4295 28.0806 2.2597 8.0168 22.9549 51.7169 1.9933 1.0000 4.0264 0.0014 1.0089 2.6630 18.2682 14.0658 21.3996 4.8308 4.8324 56.6347 11.0800 4.2883 29.8007 99.6228 29.2826 55.6331 23.2878 0.7103 0.8011 7.6459 38.9810 0.5497 8.2337 16.0120 1.3717 3.3069 0.7609 4.8311 6.5246 1.6091 0.2850 1.8526 1.6174 4.8035 0.6773
temp: 298.150 k
press: 1.00000 atm
elementType: 35 35 16 16 8 8 8 8 7 7 6 6 6 6 6 6 6 6 6 6 6 6 6 6 6 6 1 1 1 1 1 1 1 1 1 1 1 1 1 1 1 1
symmnumber: 1
zpe: 772333.8 jmol-1
zpe.correction: 0.294166 hartree
zpe.thermalcorrener: 0.320730 hartree
zpe.thermalcorrenthalpy: 0.321675 hartree
zpe.thermalcorrgfe: 0.231581 hartree
zpe.sumelectzpe: -1850.472787 hartree
zpe.sumelectthermal: -1850.446223 hartree
zpe.sumelectthermalent: -1850.445279 hartree
zpe.sumelectthermalfe: -1850.535373 hartree
dipole: 0.0036 -3.5922 0.0018
dipole: 3.5922
quadrupole: -176.6844 -189.2491 -203.6924
quadrupole: 0.0162 15.1265 -0.0114
quadrupole: 13.1909 0.6262 -13.8171 0.0162 15.1265 -0.0114
hfenergy: -1850.7669533 hartree
pointgroup: C01 [X(C16H16Br2N2O4S2)]
dipole: 0.0014108 -0.0000232 1.4132659 debye
polarizability: 432.9076253|40.9666182|203.2613204|-0.0092076|-0.0218275|267.261843 unknown
InChI: InChI=1S/C16H16Br2N2O4S2/c17-13-1-5-15(6-2-13)25(21,22)19-9-11-20(12-10-19)26(23,24)16-7-3-14(18)4-8-16/h1-8H,9-12H2
charge 0 multiplicity 1
42 atoms
Br 7.797179 0.997926 2.480567
Br -7.796433 -1.000545 2.480834
S  2.556209 -1.132867 -0.917058
S  -2.556903 1.133328 -0.917073
O  2.97408 -1.335196 -2.479921
O  1.940025 -2.379537 -0.040755
O  -2.974889 1.334998 -2.479991
O  -1.941711 2.380674 -0.041034
N  1.429882 0.438019 -0.902789
N  -1.429469 -0.436787 -0.902419
C  0.610695 0.475916 -2.15088
C  0.607655 0.484466 0.342572
C  -0.610496 -0.474782 -2.150671
C  -0.607035 -0.482514 0.342875
C  4.0342 -0.486092 0.054467
C  -4.03447 0.485718 0.05454
C  4.267878 -1.043672 1.320768
C  -4.268582 1.043379 1.320727
C  4.864522 0.479947 -0.536926
C  -4.864086 -0.481028 -0.53669
C  5.395526 -0.597732 2.047649
C  -5.395925 0.596765 2.047667
C  5.990001 0.923661 0.192725
C  -5.989263 -0.925409 0.193019
C  6.236234 0.380983 1.474573
C  -6.235915 -0.382665 1.474758
H  1.274433 0.242031 -3.001565
H  0.280577 1.528828 -2.25158
H  0.249168 1.529328 0.419264
H  1.257531 0.279478 1.212236
H  -1.274384 -0.241111 -3.001296
H  -0.280334 -1.52769 -2.251222
H  -0.248457 -1.527313 0.420016
H  -1.256786 -0.277197 1.212555
H  3.6000 -1.817094 1.714148
H  -3.601267 1.817352 1.713981
H  4.651643 0.873105 -1.535223
H  -4.650903 -0.874223 -1.534907
H  5.613166 -1.009846 3.036501
H  -5.613882 1.008908 3.036437
H  6.660218 1.675877 -0.231601
H  -6.658932 -1.678184 -0.231181
