program: Gaussian 09
title: 000020492
version: EM64L-G09RevD.01
frameworkgroup: C1[X(C14H14)]
method: RPBEPBE
basis: SDD
operation: Freq
keyword: #p
keyword: freq=noraman
keyword: PBEPBE/SDD
title: #p freq=noraman PBEPBE/SDD
converged: NO YES NO NO
title: Mulliken charges:
elementType: C C C C C C C C C C C C C C H H H H H H H H H H H H H H
charge: 0.290598 0.339955 0.318929 -0.572010 0.263438 -0.397676 -0.405579 -0.818355 -0.808662 -0.386105 -0.386113 -0.220423 -0.220426 -0.241606 0.248225 0.244041 0.229296 0.224490 0.224529 0.231552 0.224736 0.227929 0.224717 0.243696 0.243695 0.224984 0.224984 0.227164
chargesum: 0.00000
title: Mulliken charges with hydrogens summed into heavy atoms:
elementType: C C C C C C C C C C C C C C
charge: 0.290598 0.339955 0.318929 -0.323785 0.263438 -0.153635 -0.176284 -0.137785 -0.131281 -0.142409 -0.142418 0.004560 0.004558 -0.014441
polarizability: 2.13993569e+02 2.19850052e+00 1.16851292e+02 2.95252351e-03 -2.30120733e-02 1.10799848e+02
1716.lowfreq: -56.1845 -8.2259 -0.0004 0.0005 0.0006 8.4641 11.0422 62.8002 75.8886
frequency: -56.0872 62.7912 75.8851 90.9731 136.3834 163.1069 230.3436 251.1987 270.8664 293.2068 374.1187 399.0749 410.0213 443.6898 515.0597 548.4234 588.1881 590.5063 620.4484 694.6770 705.2830 730.2233 734.7795 770.5280 828.5130 852.1863 879.0368 893.3751 919.2701 951.4648 972.9630 982.3532 988.0562 991.3542 993.2183 1022.0145 1029.1050 1053.2983 1056.7487 1075.1804 1131.1617 1170.7514 1180.3817 1185.6352 1227.7140 1274.6420 1301.3064 1308.1791 1355.0098 1366.7048 1391.3769 1394.6295 1404.5028 1426.5589 1461.4331 1465.6868 1472.7163 1474.2823 1475.5816 1506.3784 1574.7828 1582.1552 1609.5192 1623.0567 2968.1417 2969.2692 3041.5403 3045.1111 3077.4600 3080.0115 3118.0595 3119.9965 3123.3075 3126.4236 3138.7286 3146.3225 3147.5588 3162.4442
redmass: 3.6170 3.5891 4.2100 1.0665 1.0671 2.9303 3.0550 3.9880 4.5048 2.7502 3.7485 2.8344 2.8727 2.8232 4.7442 3.0602 6.1195 3.8320 5.3170 5.4237 1.7689 2.7827 3.5727 2.0975 1.3578 1.2434 4.4299 1.3760 1.4507 1.3420 1.3829 1.6487 5.2811 1.5588 1.3472 2.4328 1.4496 1.6418 1.9657 1.6044 1.9216 1.0530 1.8919 1.1157 1.9664 1.5206 2.5011 1.3732 6.6832 6.7915 1.3659 2.3372 1.3105 2.1997 1.0474 1.1664 1.8344 1.0462 1.2824 2.9222 6.3031 6.0038 6.2016 6.5763 1.0369 1.0378 1.0972 1.0970 1.0988 1.0980 1.0877 1.0843 1.0915 1.0876 1.0925 1.0965 1.0968 1.1018
irintensity: 0.0000 0.9494 0.7585 0.0001 1.0154 0.2366 2.2181 0.1928 0.0220 0.1222 1.9679 0.0042 0.4035 4.9475 0.2994 14.8852 1.3427 5.3131 0.5388 3.4270 51.1318 4.2266 8.4590 38.4802 28.6822 0.1597 3.5738 5.9359 1.7222 0.4461 0.0047 10.7017 3.4422 2.5600 0.6739 3.7954 14.7686 0.0063 8.5920 7.7280 10.1172 0.0236 1.4234 1.0711 0.2365 1.4356 0.2207 0.5273 0.2070 0.1364 3.8601 6.3613 14.0410 6.7617 0.0126 23.4741 34.0502 29.7178 14.5163 8.6980 4.0245 1.4041 10.5253 1.9411 69.4752 13.2348 45.0177 0.0476 38.6738 5.4031 19.1299 1.4103 13.2795 0.4933 20.6980 15.7984 42.2459 24.6319
temp: 298.150 k
press: 1.00000 atm
elementType: 6 6 6 6 6 6 6 6 6 6 6 6 6 6 1 1 1 1 1 1 1 1 1 1 1 1 1 1
symmnumber: 1
zpe: 608997.5 jmol-1
zpe.correction: 0.231955 hartree
zpe.thermalcorrener: 0.243827 hartree
zpe.thermalcorrenthalpy: 0.244772 hartree
zpe.thermalcorrgfe: 0.193802 hartree
zpe.sumelectzpe: -540.914785 hartree
zpe.sumelectthermal: -540.902912 hartree
zpe.sumelectthermalent: -540.901968 hartree
zpe.sumelectthermalfe: -540.952937 hartree
dipole: -0.8458 0.3188 0.0004
dipole: 0.9039
quadrupole: -70.8749 -81.8358 -80.9593
quadrupole: 0.0541 0.0003 -0.0068
quadrupole: 7.0151 -3.9458 -3.0693 0.0541 0.0003 -0.0068
hfenergy: -541.1467394 hartree
pointgroup: C01 [X(C14H14)]
dipole: 0.3316597 -0.1282835 0.0000875 debye
polarizability: 214.0241022|1.36618|116.8207307|0.0011995|0.0265101|110.799876 unknown
InChI: InChI=1S/C14H14/c1-11-8-9-14(10-12(11)2)13-6-4-3-5-7-13/h3-10H,1-2H3
charge 0 multiplicity 1
28 atoms
C  0.093466 0.205871 -0.000009
C  2.335802 -0.852311 0.000358
C  2.950457 0.436619 0.000109
C  0.922231 -0.945112 0.000286
C  -1.403168 0.075347 0.000019
C  0.712762 1.480111 -0.000251
C  2.121881 1.585579 -0.000203
C  3.179643 -2.115675 0.00075
C  4.46289 0.57951 0.000143
C  -2.125027 0.012548 1.220984
C  -2.124897 0.010201 -1.2209
C  -3.533741 -0.111707 1.22218
C  -3.533618 -0.114055 -1.222013
C  -4.242971 -0.175484 0.000104
H  0.452699 -1.936379 0.000441
H  0.093955 2.384647 -0.000518
H  2.585599 2.579482 -0.000412
H  3.838409 -2.16607 -0.887534
H  3.83718 -2.166285 0.889936
H  2.545779 -3.019297 0.000204
H  4.917595 0.101059 -0.888611
H  4.763016 1.641866 0.000263
H  4.9176 0.100844 0.888774
H  -1.579273 0.06154 2.170341
H  -1.579054 0.057387 -2.170298
H  -4.075287 -0.158648 2.174018
H  -4.075063 -0.162811 -2.173817
H  -5.334765 -0.271778 0.000159
