program: Gaussian 09
title: 000241099
version: EM64L-G09RevD.01
frameworkgroup: C1[X(C17H30O2)]
method: RPBEPBE
basis: SDD
operation: Freq
keyword: #pfreq=noraman
keyword: PBEPBE/SDD
title: #p freq=noraman PBEPBE/SDD
converged: NO YES NO NO
title: Mulliken charges:
elementType: O O C C C C C C C C C C C C C C C C C H H H H H H H H H H H H H H H H H H H H H H H H H H H H H H
charge: -0.275087 -0.234130 -0.053017 -0.004976 -0.097002 -0.032501 -0.392160 -0.470002 -0.462462 -0.415617 -0.479240 -0.363505 -0.449384 -0.207046 -0.353143 -0.713119 -0.193025 -0.359324 -0.697035 0.241029 0.177948 0.250727 0.175075 0.243210 0.176583 0.199198 0.212522 0.197449 0.234150 0.212793 0.198211 0.244310 0.201781 0.224877 0.179382 0.213678 0.208943 0.199273 0.181755 0.191866 0.219354 0.222315 0.218416 0.199888 0.194193 0.198132 0.208626 0.215413 0.210677
chargesum: 0.00000
title: Mulliken charges with hydrogens summed into heavy atoms:
elementType: O O C C C C C C C C C C C C C C C C C
charge: -0.275087 -0.234130 0.188012 0.172972 0.153725 0.142574 0.027632 -0.058282 -0.030863 -0.004613 -0.033148 0.040755 -0.026763 -0.007773 0.020477 -0.053034 0.006863 0.033001 -0.062319
polarizability: 2.05563705e+02 1.31841231e+00 2.14495249e+02 -6.78965297e-01 2.77160594e+00 1.39214654e+02
1716.lowfreq: -6.2245 0.0005 0.0007 0.0008 8.7192 11.4363 29.7214 30.3628 39.5395
frequency: 29.6830 30.3362 39.5348 43.7746 61.7353 74.1018 93.9605 105.6733 112.8447 122.8326 149.9318 166.1819 179.8401 193.5689 209.6773 226.7719 236.6051 248.3635 268.5024 315.8622 349.9840 375.4168 385.8416 403.4283 414.1425 462.3409 480.0400 496.6652 507.4699 528.5551 559.8920 639.3168 661.3312 723.6847 744.8589 745.7419 762.6126 809.3797 825.5311 861.0551 870.3503 885.8956 894.5632 897.5306 914.9505 923.1673 925.9382 948.0561 964.2330 973.5569 974.0690 978.3741 1005.6687 1022.5517 1038.8690 1051.3635 1061.2303 1066.5885 1068.8391 1082.9894 1096.4816 1101.5865 1111.6492 1123.0197 1129.3414 1133.2808 1145.6906 1158.5316 1193.8867 1197.9098 1213.4379 1219.6621 1235.8063 1242.4190 1244.3560 1261.4318 1270.9560 1282.0947 1286.4338 1289.6154 1294.5137 1297.4869 1302.3288 1311.4207 1329.7532 1331.1425 1332.2769 1337.3685 1347.1207 1351.9624 1355.6281 1359.4777 1366.5178 1379.4648 1385.2032 1389.0234 1393.0359 1447.6363 1455.7594 1458.0469 1459.7844 1463.6583 1469.0428 1470.9916 1474.1118 1476.5333 1479.6960 1480.2667 1487.5752 1489.6377 1675.2181 2852.5299 2888.4062 2912.1623 2943.0197 2949.5910 2954.0055 2960.1420 2964.9213 2967.2909 2969.3739 2970.9916 2979.3087 2980.1619 2992.3139 2993.9935 3001.8782 3008.6546 3018.5940 3029.0121 3031.9882 3036.1398 3055.0480 3058.1597 3067.8722 3069.8031 3073.0517 3077.9049 3087.7861 3088.8934 3121.8813
redmass: 3.0153 3.8124 1.5416 3.6210 2.9854 2.5500 3.1768 2.5060 2.8286 1.7880 2.9791 3.4613 2.1316 2.4530 1.9345 1.1266 3.1059 1.9052 3.3842 2.9534 3.0425 2.3462 2.7361 1.9470 3.3415 4.8705 3.9380 4.1296 2.9502 3.3255 3.6915 3.0263 1.3633 1.0818 1.8924 1.2418 1.2492 1.6324 1.9461 2.4828 1.9113 2.1794 2.1290 3.1864 1.9469 1.6638 2.1886 3.2289 1.6279 2.2398 1.2978 2.1157 3.3664 4.6942 2.4087 2.9787 2.0259 1.8301 1.9244 2.0933 2.1038 2.0102 2.3092 2.0567 1.9491 1.3297 2.3611 1.8114 1.2550 1.4125 1.3642 1.3374 1.3101 1.2732 1.2664 1.2526 1.2676 1.1650 1.1064 1.1605 1.2912 1.1922 1.1822 1.2929 1.4569 1.4893 1.4272 1.3157 1.4791 1.3783 1.6376 1.3850 1.5415 1.5811 1.7900 1.2187 1.2145 1.0843 1.0963 1.0901 1.0781 1.0690 1.0732 1.0662 1.0912 1.0430 1.0514 1.0720 1.0877 1.0571 6.4089 1.0817 1.0812 1.0695 1.0692 1.0590 1.0636 1.0643 1.0641 1.0598 1.0669 1.0372 1.0400 1.0563 1.0957 1.0824 1.0862 1.0894 1.0985 1.0995 1.0977 1.0903 1.1021 1.0977 1.1006 1.0993 1.0994 1.0993 1.0940 1.0837 1.0993
irintensity: 0.1691 0.0264 0.0091 0.1563 0.2251 0.2129 0.1468 0.3597 0.6787 0.1073 1.6008 0.7948 0.9836 0.2999 1.0558 0.0061 0.9740 3.3886 0.0887 2.2577 1.2923 0.1753 0.9752 0.1375 6.9059 1.3872 0.5857 0.7942 0.9226 5.3879 7.1359 18.8282 36.3602 9.7852 4.9175 0.9068 10.6150 0.2412 0.8076 23.6860 1.4954 27.9915 29.8658 40.4173 3.7527 2.0912 22.7081 39.5443 3.6514 37.0488 5.3178 10.9046 6.0061 95.6760 5.2754 13.5992 2.9573 15.9730 14.3625 14.0038 4.6381 0.6002 28.3460 5.6780 23.7657 24.7428 5.0379 1.9858 0.5996 2.7027 8.7214 7.3674 2.1323 8.4599 6.2163 2.6962 1.2819 0.8738 0.7007 4.7114 1.9019 11.0293 13.0567 6.3225 1.3536 1.4294 2.4799 26.5596 1.3353 1.7208 0.6024 6.3001 3.3956 0.4454 11.2155 11.6410 14.9167 3.4229 1.2903 6.4073 22.1015 0.0992 0.8612 3.8598 6.9794 12.5806 10.1013 0.8681 19.1403 13.3753 6.7464 53.6792 31.0763 73.0167 31.7271 11.5850 41.2872 4.7581 25.0218 71.8714 22.6404 34.6149 51.8127 22.0939 7.0895 28.0906 8.4240 57.6836 21.4906 12.9507 13.6739 23.9190 60.5728 38.4821 102.5313 55.0056 48.8115 61.0282 31.8058 10.9381 81.1166
temp: 298.150 k
press: 1.00000 atm
elementType: 8 8 6 6 6 6 6 6 6 6 6 6 6 6 6 6 6 6 6 1 1 1 1 1 1 1 1 1 1 1 1 1 1 1 1 1 1 1 1 1 1 1 1 1 1 1 1 1 1
symmnumber: 1
zpe: 1147757.1 jmol-1
zpe.correction: 0.437158 hartree
zpe.thermalcorrener: 0.458486 hartree
zpe.thermalcorrenthalpy: 0.459431 hartree
zpe.thermalcorrgfe: 0.385248 hartree
zpe.sumelectzpe: -814.692474 hartree
zpe.sumelectthermal: -814.671145 hartree
zpe.sumelectthermalent: -814.670201 hartree
zpe.sumelectthermalfe: -814.744383 hartree
dipole: 1.8217 1.3468 1.3815
dipole: 2.6535
quadrupole: -121.7847 -112.0599 -119.0677
quadrupole: 3.6095 -1.2971 2.1463
quadrupole: -4.1472 5.5775 -1.4303 3.6095 -1.2971 2.1463
hfenergy: -815.1296317 hartree
pointgroup: C01 [X(C17H30O2)]
dipole: 0.7466138 0.488054 0.5424203 debye
polarizability: 205.7376145|1.8192207|214.3121501|-0.668123|2.8875957|139.2238439 unknown
InChI: InChI=1S/C17H30O2/c1-3-5-7-12-16-14(4-2)13-18-17(19-16)15-10-8-6-9-11-15/h6,8,14-17H,3-5,7,9-13H2,1-2H3
charge 0 multiplicity 1
49 atoms
O  -0.004244 0.124741 -0.204369
O  -1.658293 1.865726 -0.26549
C  0.77174 2.486362 -0.26276
C  1.07541 1.046579 0.244392
C  -2.360919 -0.46161 -0.19631
C  -1.314263 0.549167 0.274012
C  -0.66664 2.866055 0.166831
C  2.38429 0.432434 -0.272446
C  -2.084144 -1.871393 0.382551
C  1.796037 3.521007 0.273178
C  -3.790423 0.005612 0.177884
C  2.67172 -0.969603 0.309868
C  -3.065777 -2.909091 -0.209991
C  -4.818882 -1.092954 -0.021396
C  3.96465 -1.59945 -0.25301
C  1.555262 4.96545 -0.223089
C  -4.496894 -2.399721 -0.21432
C  4.263187 -2.999036 0.331859
C  5.551558 -3.630558 -0.238257
H  0.80752 2.467703 -1.370924
H  1.076059 1.058167 1.362912
H  -2.280536 -0.512174 -1.300419
H  -1.275772 0.629741 1.392005
H  -0.996019 3.809747 -0.294576
H  -0.707007 2.971693 1.276868
H  3.22628 1.108528 -0.027183
H  2.323704 0.372509 -1.377651
H  -2.20999 -1.839031 1.484706
H  -1.039215 -2.164426 0.177106
H  2.813777 3.211528 -0.030756
H  1.784654 3.504851 1.383683
H  -4.056904 0.894121 -0.423745
H  -3.810241 0.348274 1.23624
H  1.808491 -1.627526 0.095162
H  2.749305 -0.899768 1.415815
H  -2.76172 -3.168527 -1.246693
H  -3.008324 -3.855025 0.36527
H  -5.875826 -0.7906 -0.014214
H  4.826499 -0.928627 -0.049677
H  3.884169 -1.675183 -1.35774
H  2.374537 5.631808 0.102897
H  0.611967 5.38845 0.166572
H  1.510851 5.002067 -1.327835
H  -5.295448 -3.136769 -0.380329
H  4.344405 -2.922522 1.435672
H  3.401303 -3.667295 0.130037
H  6.433019 -2.996931 -0.023413
H  5.740193 -4.629823 0.195853
H  5.482796 -3.746576 -1.33648
